{"text_format":"1","workbook":"xlsx","n_sheets":9,"sheets":["DC","Engagements","Niv DC","Niv BP","Cat. d'âge","Records_DC_F","Records_DC_H","Records_BP_F","Records_BP_H"],"not_rendered":{"charts":0,"images":5,"macros":1,"external_links":2,"defined_names":7,"comments":0,"pivot_tables":0},"unopened":[],"bounds":{"document_bytes":16777216,"sheet_cells":100000,"rows_first":2000,"rows_last":500,"rows_between":2000,"halvings":0,"cell_chars":16384,"cell_head_chars":4096},"cells_cut":0,"cells_raw":0,"read":"whole","date_system":"1900"}

{"sheet":"DC","index":0,"n_rows":30,"n_cols":26,"rows_kept":30,"cut":false,"hidden":false,"merged":[[0,0,0,2],[6,1,7,1],[4,1,4,3],[6,4,7,4],[0,5,1,10],[2,5,2,10],[3,5,3,10],[6,2,7,2],[6,9,7,9],[1,0,1,2],[6,10,7,10],[2,0,2,2],[6,0,7,0],[6,7,7,7],[6,5,7,5],[4,5,4,10],[30,11,30,15],[29,11,29,15],[6,6,7,6],[6,17,7,17],[6,14,7,14],[6,15,7,15],[6,16,7,16],[30,0,30,4],[30,7,30,10],[29,7,29,10],[29,0,29,1],[6,3,7,3],[29,5,29,6],[30,5,30,6],[6,8,7,8],[6,25,7,25],[29,16,29,18],[30,16,30,18],[6,24,7,24],[6,23,7,23],[6,21,7,21],[6,22,7,22],[6,19,7,19],[6,18,7,18]]}
[null,null,null,null,null,"Feuille de Match 2024"]
[]
[null,null,null,null,null,"BORDEAUX"]
[null,null,null,null,null,"2024-03-13"]
["Ligue","NOUVELLE AQUITAINE",null,null,130324,"A utiliser à partir du 13 Mars 2024",null,null,null,null,null,null,"Compétition","Open de Bordeaux - ne pas fusionner"]
[130324]
["Licen.","CLUB","S      F-M","Date nais.","Cat.    d'âge      A","NOM","Prénom","Poids   de      corps","Cat.    Poids","Indice","Lot.","DC",null,null,"TOTAL Réalisé","Clas. ","Total Points","Niveau               Cat. Âge A","Niveau               Open","Choix discipline",null,"Cat.    d'âge A+1","Niveau               Cat. Âge A+1","hauteur DC","hauteur sécurité","hauteur de cales "]
[null,null,null,null,null,null,null,null,null,null,null,1,2,3]
["xx","xx","F","1999-02-01",{"$f":"IF(EXACT(C9,\"M\"),calcul_age(T9,D9),IF(EXACT(C9,\"F\"),calcul_age(T9,D9),\"\"))","v":"SNR"},"x","x",64,{"$f":"IF(H9=\"\",\"\",IF(EXACT(C9,\"M\"),categorie_poids_homme(T9,E9,H9),IF(EXACT(C9,\"F\"),categorie_poids_femme(T9,E9,H9),\" \")))","v":"69 Kg"},{"$f":"IF(H9=\"\",\"\",ROUNDUP(IF(EXACT(C9,\"M\"),IF(T9=\"DC\",indice_homme_DC(H9),indice_homme_BP(H9)),IF(EXACT(C9,\"F\"),IF(T9=\"DC\",indice_femme_DC(H9),indice_femme_BP(H9)),0)),6))","v":0.82726300000000008},null,20,60,65,{"$f":"IF(AND(L9=\"\",M9=\"\",N9=\"\"),\"\",calcul_total_DC(L9,M9,N9))","v":65},null,{"$f":"IF(OR(J9=\"\",O9=\"\"),\"\",O9*J9)","v":53.772095000000007},{"$f":"IF(O9=\"\",\"\",IF(EXACT(C9,\"M\"),niv_homme(T9,E9,H9,O9),IF(EXACT(C9,\"F\"),niv_femme(T9,E9,H9,O9))))","v":"R1"},{"$f":"IF(O9=\"\",\"\",IF(EXACT(C9,\"M\"),niv_open_homme(T9,E9,H9,O9),IF(EXACT(C9,\"F\"),niv_open_femme(T9,E9,H9,O9),\" \")))","v":"R1"},"DC",null,{"$f":"IF(EXACT(C9,\"M\"),calcul_age_A1(T9,D9),IF(EXACT(C9,\"F\"),calcul_age_A1(T9,D9),\"\"))","v":"SNR"},{"$f":"IF(O9=\"\",\"\",IF(EXACT(C9,\"M\"),niv_homme(T9,V9,H9,O9),IF(EXACT(C9,\"F\"),niv_femme(T9,V9,H9,O9))))","v":"R1"}]
[null,null,null,null,{"$f":"IF(EXACT(C10,\"M\"),calcul_age(T10,D10),IF(EXACT(C10,\"F\"),calcul_age(T10,D10),\"\"))","v":""},null,null,null,{"$f":"IF(H10=\"\",\"\",IF(EXACT(C10,\"M\"),categorie_poids_homme(T10,E10,H10),IF(EXACT(C10,\"F\"),categorie_poids_femme(T10,E10,H10),\" \")))","v":""},{"$f":"IF(H10=\"\",\"\",ROUNDUP(IF(EXACT(C10,\"M\"),IF(T10=\"DC\",indice_homme_DC(H10),indice_homme_BP(H10)),IF(EXACT(C10,\"F\"),IF(T10=\"DC\",indice_femme_DC(H10),indice_femme_BP(H10)),0)),6))","v":""},null,null,null,null,{"$f":"IF(AND(L10=\"\",M10=\"\",N10=\"\"),\"\",calcul_total_DC(L10,M10,N10))","v":""},null,"",{"$f":"IF(O10=\"\",\"\",IF(EXACT(C10,\"M\"),niv_homme(T10,E10,H10,O10),IF(EXACT(C10,\"F\"),niv_femme(T10,E10,H10,O10))))","v":""},{"$f":"IF(O10=\"\",\"\",IF(EXACT(C10,\"M\"),niv_open_homme(T10,E10,H10,O10),IF(EXACT(C10,\"F\"),niv_open_femme(T10,E10,H10,O10),\" \")))","v":""},"DC",null,{"$f":"IF(EXACT(C10,\"M\"),calcul_age_A1(T10,D10),IF(EXACT(C10,\"F\"),calcul_age_A1(T10,D10),\"\"))","v":""},{"$f":"IF(O10=\"\",\"\",IF(EXACT(C10,\"M\"),niv_homme(T10,V10,H10,O10),IF(EXACT(C10,\"F\"),niv_femme(T10,V10,H10,O10))))","v":""}]
[null,null,null,null,{"$f":"IF(EXACT(C11,\"M\"),calcul_age(T11,D11),IF(EXACT(C11,\"F\"),calcul_age(T11,D11),\"\"))","v":""},null,null,null,{"$f":"IF(H11=\"\",\"\",IF(EXACT(C11,\"M\"),categorie_poids_homme(T11,E11,H11),IF(EXACT(C11,\"F\"),categorie_poids_femme(T11,E11,H11),\" \")))","v":""},{"$f":"IF(H11=\"\",\"\",ROUNDUP(IF(EXACT(C11,\"M\"),IF(T11=\"DC\",indice_homme_DC(H11),indice_homme_BP(H11)),IF(EXACT(C11,\"F\"),IF(T11=\"DC\",indice_femme_DC(H11),indice_femme_BP(H11)),0)),6))","v":""},null,null,null,null,{"$f":"IF(AND(L11=\"\",M11=\"\",N11=\"\"),\"\",calcul_total_DC(L11,M11,N11))","v":""},null,"",{"$f":"IF(O11=\"\",\"\",IF(EXACT(C11,\"M\"),niv_homme(T11,E11,H11,O11),IF(EXACT(C11,\"F\"),niv_femme(T11,E11,H11,O11))))","v":""},{"$f":"IF(O11=\"\",\"\",IF(EXACT(C11,\"M\"),niv_open_homme(T11,E11,H11,O11),IF(EXACT(C11,\"F\"),niv_open_femme(T11,E11,H11,O11),\" \")))","v":""},"DC",null,{"$f":"IF(EXACT(C11,\"M\"),calcul_age_A1(T11,D11),IF(EXACT(C11,\"F\"),calcul_age_A1(T11,D11),\"\"))","v":""},{"$f":"IF(O11=\"\",\"\",IF(EXACT(C11,\"M\"),niv_homme(T11,V11,H11,O11),IF(EXACT(C11,\"F\"),niv_femme(T11,V11,H11,O11))))","v":""}]
[null,null,null,null,{"$f":"IF(EXACT(C12,\"M\"),calcul_age(T12,D12),IF(EXACT(C12,\"F\"),calcul_age(T12,D12),\"\"))","v":""},null,null,null,{"$f":"IF(H12=\"\",\"\",IF(EXACT(C12,\"M\"),categorie_poids_homme(T12,E12,H12),IF(EXACT(C12,\"F\"),categorie_poids_femme(T12,E12,H12),\" \")))","v":""},{"$f":"IF(H12=\"\",\"\",ROUNDUP(IF(EXACT(C12,\"M\"),IF(T12=\"DC\",indice_homme_DC(H12),indice_homme_BP(H12)),IF(EXACT(C12,\"F\"),IF(T12=\"DC\",indice_femme_DC(H12),indice_femme_BP(H12)),0)),6))","v":""},null,null,null,null,{"$f":"IF(AND(L12=\"\",M12=\"\",N12=\"\"),\"\",calcul_total_DC(L12,M12,N12))","v":""},null,"",{"$f":"IF(O12=\"\",\"\",IF(EXACT(C12,\"M\"),niv_homme(T12,E12,H12,O12),IF(EXACT(C12,\"F\"),niv_femme(T12,E12,H12,O12))))","v":""},{"$f":"IF(O12=\"\",\"\",IF(EXACT(C12,\"M\"),niv_open_homme(T12,E12,H12,O12),IF(EXACT(C12,\"F\"),niv_open_femme(T12,E12,H12,O12),\" \")))","v":""},"DC",null,{"$f":"IF(EXACT(C12,\"M\"),calcul_age_A1(T12,D12),IF(EXACT(C12,\"F\"),calcul_age_A1(T12,D12),\"\"))","v":""},{"$f":"IF(O12=\"\",\"\",IF(EXACT(C12,\"M\"),niv_homme(T12,V12,H12,O12),IF(EXACT(C12,\"F\"),niv_femme(T12,V12,H12,O12))))","v":""}]
[null,null,null,null,{"$f":"IF(EXACT(C13,\"M\"),calcul_age(T13,D13),IF(EXACT(C13,\"F\"),calcul_age(T13,D13),\"\"))","v":""},null,null,null,{"$f":"IF(H13=\"\",\"\",IF(EXACT(C13,\"M\"),categorie_poids_homme(T13,E13,H13),IF(EXACT(C13,\"F\"),categorie_poids_femme(T13,E13,H13),\" \")))","v":""},{"$f":"IF(H13=\"\",\"\",ROUNDUP(IF(EXACT(C13,\"M\"),IF(T13=\"DC\",indice_homme_DC(H13),indice_homme_BP(H13)),IF(EXACT(C13,\"F\"),IF(T13=\"DC\",indice_femme_DC(H13),indice_femme_BP(H13)),0)),6))","v":""},null,null,null,null,{"$f":"IF(AND(L13=\"\",M13=\"\",N13=\"\"),\"\",calcul_total_DC(L13,M13,N13))","v":""},null,"",{"$f":"IF(O13=\"\",\"\",IF(EXACT(C13,\"M\"),niv_homme(T13,E13,H13,O13),IF(EXACT(C13,\"F\"),niv_femme(T13,E13,H13,O13))))","v":""},{"$f":"IF(O13=\"\",\"\",IF(EXACT(C13,\"M\"),niv_open_homme(T13,E13,H13,O13),IF(EXACT(C13,\"F\"),niv_open_femme(T13,E13,H13,O13),\" \")))","v":""},"DC",null,{"$f":"IF(EXACT(C13,\"M\"),calcul_age_A1(T13,D13),IF(EXACT(C13,\"F\"),calcul_age_A1(T13,D13),\"\"))","v":""},{"$f":"IF(O13=\"\",\"\",IF(EXACT(C13,\"M\"),niv_homme(T13,V13,H13,O13),IF(EXACT(C13,\"F\"),niv_femme(T13,V13,H13,O13))))","v":""}]
[null,null,null,null,{"$f":"IF(EXACT(C14,\"M\"),calcul_age(T14,D14),IF(EXACT(C14,\"F\"),calcul_age(T14,D14),\"\"))","v":""},null,null,null,{"$f":"IF(H14=\"\",\"\",IF(EXACT(C14,\"M\"),categorie_poids_homme(T14,E14,H14),IF(EXACT(C14,\"F\"),categorie_poids_femme(T14,E14,H14),\" \")))","v":""},{"$f":"IF(H14=\"\",\"\",ROUNDUP(IF(EXACT(C14,\"M\"),IF(T14=\"DC\",indice_homme_DC(H14),indice_homme_BP(H14)),IF(EXACT(C14,\"F\"),IF(T14=\"DC\",indice_femme_DC(H14),indice_femme_BP(H14)),0)),6))","v":""},null,null,null,null,{"$f":"IF(AND(L14=\"\",M14=\"\",N14=\"\"),\"\",calcul_total_DC(L14,M14,N14))","v":""},null,"",{"$f":"IF(O14=\"\",\"\",IF(EXACT(C14,\"M\"),niv_homme(T14,E14,H14,O14),IF(EXACT(C14,\"F\"),niv_femme(T14,E14,H14,O14))))","v":""},{"$f":"IF(O14=\"\",\"\",IF(EXACT(C14,\"M\"),niv_open_homme(T14,E14,H14,O14),IF(EXACT(C14,\"F\"),niv_open_femme(T14,E14,H14,O14),\" \")))","v":""},"DC",null,{"$f":"IF(EXACT(C14,\"M\"),calcul_age_A1(T14,D14),IF(EXACT(C14,\"F\"),calcul_age_A1(T14,D14),\"\"))","v":""},{"$f":"IF(O14=\"\",\"\",IF(EXACT(C14,\"M\"),niv_homme(T14,V14,H14,O14),IF(EXACT(C14,\"F\"),niv_femme(T14,V14,H14,O14))))","v":""}]
[null,null,null,null,{"$f":"IF(EXACT(C15,\"M\"),calcul_age(T15,D15),IF(EXACT(C15,\"F\"),calcul_age(T15,D15),\"\"))","v":""},null,null,null,{"$f":"IF(H15=\"\",\"\",IF(EXACT(C15,\"M\"),categorie_poids_homme(T15,E15,H15),IF(EXACT(C15,\"F\"),categorie_poids_femme(T15,E15,H15),\" \")))","v":""},{"$f":"IF(H15=\"\",\"\",ROUNDUP(IF(EXACT(C15,\"M\"),IF(T15=\"DC\",indice_homme_DC(H15),indice_homme_BP(H15)),IF(EXACT(C15,\"F\"),IF(T15=\"DC\",indice_femme_DC(H15),indice_femme_BP(H15)),0)),6))","v":""},null,null,null,null,{"$f":"IF(AND(L15=\"\",M15=\"\",N15=\"\"),\"\",calcul_total_DC(L15,M15,N15))","v":""},null,"",{"$f":"IF(O15=\"\",\"\",IF(EXACT(C15,\"M\"),niv_homme(T15,E15,H15,O15),IF(EXACT(C15,\"F\"),niv_femme(T15,E15,H15,O15))))","v":""},{"$f":"IF(O15=\"\",\"\",IF(EXACT(C15,\"M\"),niv_open_homme(T15,E15,H15,O15),IF(EXACT(C15,\"F\"),niv_open_femme(T15,E15,H15,O15),\" \")))","v":""},"DC",null,{"$f":"IF(EXACT(C15,\"M\"),calcul_age_A1(T15,D15),IF(EXACT(C15,\"F\"),calcul_age_A1(T15,D15),\"\"))","v":""},{"$f":"IF(O15=\"\",\"\",IF(EXACT(C15,\"M\"),niv_homme(T15,V15,H15,O15),IF(EXACT(C15,\"F\"),niv_femme(T15,V15,H15,O15))))","v":""}]
[null,null,null,null,{"$f":"IF(EXACT(C16,\"M\"),calcul_age(T16,D16),IF(EXACT(C16,\"F\"),calcul_age(T16,D16),\"\"))","v":""},null,null,null,{"$f":"IF(H16=\"\",\"\",IF(EXACT(C16,\"M\"),categorie_poids_homme(T16,E16,H16),IF(EXACT(C16,\"F\"),categorie_poids_femme(T16,E16,H16),\" \")))","v":""},{"$f":"IF(H16=\"\",\"\",ROUNDUP(IF(EXACT(C16,\"M\"),IF(T16=\"DC\",indice_homme_DC(H16),indice_homme_BP(H16)),IF(EXACT(C16,\"F\"),IF(T16=\"DC\",indice_femme_DC(H16),indice_femme_BP(H16)),0)),6))","v":""},null,null,null,null,{"$f":"IF(AND(L16=\"\",M16=\"\",N16=\"\"),\"\",calcul_total_DC(L16,M16,N16))","v":""},null,"",{"$f":"IF(O16=\"\",\"\",IF(EXACT(C16,\"M\"),niv_homme(T16,E16,H16,O16),IF(EXACT(C16,\"F\"),niv_femme(T16,E16,H16,O16))))","v":""},{"$f":"IF(O16=\"\",\"\",IF(EXACT(C16,\"M\"),niv_open_homme(T16,E16,H16,O16),IF(EXACT(C16,\"F\"),niv_open_femme(T16,E16,H16,O16),\" \")))","v":""},"DC",null,{"$f":"IF(EXACT(C16,\"M\"),calcul_age_A1(T16,D16),IF(EXACT(C16,\"F\"),calcul_age_A1(T16,D16),\"\"))","v":""},{"$f":"IF(O16=\"\",\"\",IF(EXACT(C16,\"M\"),niv_homme(T16,V16,H16,O16),IF(EXACT(C16,\"F\"),niv_femme(T16,V16,H16,O16))))","v":""}]
[null,null,null,null,{"$f":"IF(EXACT(C17,\"M\"),calcul_age(T17,D17),IF(EXACT(C17,\"F\"),calcul_age(T17,D17),\"\"))","v":""},null,null,null,{"$f":"IF(H17=\"\",\"\",IF(EXACT(C17,\"M\"),categorie_poids_homme(T17,E17,H17),IF(EXACT(C17,\"F\"),categorie_poids_femme(T17,E17,H17),\" \")))","v":""},{"$f":"IF(H17=\"\",\"\",ROUNDUP(IF(EXACT(C17,\"M\"),IF(T17=\"DC\",indice_homme_DC(H17),indice_homme_BP(H17)),IF(EXACT(C17,\"F\"),IF(T17=\"DC\",indice_femme_DC(H17),indice_femme_BP(H17)),0)),6))","v":""},null,null,null,null,{"$f":"IF(AND(L17=\"\",M17=\"\",N17=\"\"),\"\",calcul_total_DC(L17,M17,N17))","v":""},null,"",{"$f":"IF(O17=\"\",\"\",IF(EXACT(C17,\"M\"),niv_homme(T17,E17,H17,O17),IF(EXACT(C17,\"F\"),niv_femme(T17,E17,H17,O17))))","v":""},{"$f":"IF(O17=\"\",\"\",IF(EXACT(C17,\"M\"),niv_open_homme(T17,E17,H17,O17),IF(EXACT(C17,\"F\"),niv_open_femme(T17,E17,H17,O17),\" \")))","v":""},"DC",null,{"$f":"IF(EXACT(C17,\"M\"),calcul_age_A1(T17,D17),IF(EXACT(C17,\"F\"),calcul_age_A1(T17,D17),\"\"))","v":""},{"$f":"IF(O17=\"\",\"\",IF(EXACT(C17,\"M\"),niv_homme(T17,V17,H17,O17),IF(EXACT(C17,\"F\"),niv_femme(T17,V17,H17,O17))))","v":""}]
[null,null,null,null,{"$f":"IF(EXACT(C18,\"M\"),calcul_age(T18,D18),IF(EXACT(C18,\"F\"),calcul_age(T18,D18),\"\"))","v":""},null,null,null,{"$f":"IF(H18=\"\",\"\",IF(EXACT(C18,\"M\"),categorie_poids_homme(T18,E18,H18),IF(EXACT(C18,\"F\"),categorie_poids_femme(T18,E18,H18),\" \")))","v":""},{"$f":"IF(H18=\"\",\"\",ROUNDUP(IF(EXACT(C18,\"M\"),IF(T18=\"DC\",indice_homme_DC(H18),indice_homme_BP(H18)),IF(EXACT(C18,\"F\"),IF(T18=\"DC\",indice_femme_DC(H18),indice_femme_BP(H18)),0)),6))","v":""},null,null,null,null,{"$f":"IF(AND(L18=\"\",M18=\"\",N18=\"\"),\"\",calcul_total_DC(L18,M18,N18))","v":""},null,"",{"$f":"IF(O18=\"\",\"\",IF(EXACT(C18,\"M\"),niv_homme(T18,E18,H18,O18),IF(EXACT(C18,\"F\"),niv_femme(T18,E18,H18,O18))))","v":""},{"$f":"IF(O18=\"\",\"\",IF(EXACT(C18,\"M\"),niv_open_homme(T18,E18,H18,O18),IF(EXACT(C18,\"F\"),niv_open_femme(T18,E18,H18,O18),\" \")))","v":""},"DC",null,{"$f":"IF(EXACT(C18,\"M\"),calcul_age_A1(T18,D18),IF(EXACT(C18,\"F\"),calcul_age_A1(T18,D18),\"\"))","v":""},{"$f":"IF(O18=\"\",\"\",IF(EXACT(C18,\"M\"),niv_homme(T18,V18,H18,O18),IF(EXACT(C18,\"F\"),niv_femme(T18,V18,H18,O18))))","v":""}]
[null,null,null,null,{"$f":"IF(EXACT(C19,\"M\"),calcul_age(T19,D19),IF(EXACT(C19,\"F\"),calcul_age(T19,D19),\"\"))","v":""},null,null,null,{"$f":"IF(H19=\"\",\"\",IF(EXACT(C19,\"M\"),categorie_poids_homme(T19,E19,H19),IF(EXACT(C19,\"F\"),categorie_poids_femme(T19,E19,H19),\" \")))","v":""},{"$f":"IF(H19=\"\",\"\",ROUNDUP(IF(EXACT(C19,\"M\"),IF(T19=\"DC\",indice_homme_DC(H19),indice_homme_BP(H19)),IF(EXACT(C19,\"F\"),IF(T19=\"DC\",indice_femme_DC(H19),indice_femme_BP(H19)),0)),6))","v":""},null,null,null,null,{"$f":"IF(AND(L19=\"\",M19=\"\",N19=\"\"),\"\",calcul_total_DC(L19,M19,N19))","v":""},null,"",{"$f":"IF(O19=\"\",\"\",IF(EXACT(C19,\"M\"),niv_homme(T19,E19,H19,O19),IF(EXACT(C19,\"F\"),niv_femme(T19,E19,H19,O19))))","v":""},{"$f":"IF(O19=\"\",\"\",IF(EXACT(C19,\"M\"),niv_open_homme(T19,E19,H19,O19),IF(EXACT(C19,\"F\"),niv_open_femme(T19,E19,H19,O19),\" \")))","v":""},"DC",null,{"$f":"IF(EXACT(C19,\"M\"),calcul_age_A1(T19,D19),IF(EXACT(C19,\"F\"),calcul_age_A1(T19,D19),\"\"))","v":""},{"$f":"IF(O19=\"\",\"\",IF(EXACT(C19,\"M\"),niv_homme(T19,V19,H19,O19),IF(EXACT(C19,\"F\"),niv_femme(T19,V19,H19,O19))))","v":""}]
[null,null,null,null,{"$f":"IF(EXACT(C20,\"M\"),calcul_age(T20,D20),IF(EXACT(C20,\"F\"),calcul_age(T20,D20),\"\"))","v":""},null,null,null,{"$f":"IF(H20=\"\",\"\",IF(EXACT(C20,\"M\"),categorie_poids_homme(T20,E20,H20),IF(EXACT(C20,\"F\"),categorie_poids_femme(T20,E20,H20),\" \")))","v":""},{"$f":"IF(H20=\"\",\"\",ROUNDUP(IF(EXACT(C20,\"M\"),IF(T20=\"DC\",indice_homme_DC(H20),indice_homme_BP(H20)),IF(EXACT(C20,\"F\"),IF(T20=\"DC\",indice_femme_DC(H20),indice_femme_BP(H20)),0)),6))","v":""},null,null,null,null,{"$f":"IF(AND(L20=\"\",M20=\"\",N20=\"\"),\"\",calcul_total_DC(L20,M20,N20))","v":""},null,"",{"$f":"IF(O20=\"\",\"\",IF(EXACT(C20,\"M\"),niv_homme(T20,E20,H20,O20),IF(EXACT(C20,\"F\"),niv_femme(T20,E20,H20,O20))))","v":""},{"$f":"IF(O20=\"\",\"\",IF(EXACT(C20,\"M\"),niv_open_homme(T20,E20,H20,O20),IF(EXACT(C20,\"F\"),niv_open_femme(T20,E20,H20,O20),\" \")))","v":""},"DC",null,{"$f":"IF(EXACT(C20,\"M\"),calcul_age_A1(T20,D20),IF(EXACT(C20,\"F\"),calcul_age_A1(T20,D20),\"\"))","v":""},{"$f":"IF(O20=\"\",\"\",IF(EXACT(C20,\"M\"),niv_homme(T20,V20,H20,O20),IF(EXACT(C20,\"F\"),niv_femme(T20,V20,H20,O20))))","v":""}]
[null,null,null,null,{"$f":"IF(EXACT(C21,\"M\"),calcul_age(T21,D21),IF(EXACT(C21,\"F\"),calcul_age(T21,D21),\"\"))","v":""},null,null,null,{"$f":"IF(H21=\"\",\"\",IF(EXACT(C21,\"M\"),categorie_poids_homme(T21,E21,H21),IF(EXACT(C21,\"F\"),categorie_poids_femme(T21,E21,H21),\" \")))","v":""},{"$f":"IF(H21=\"\",\"\",ROUNDUP(IF(EXACT(C21,\"M\"),IF(T21=\"DC\",indice_homme_DC(H21),indice_homme_BP(H21)),IF(EXACT(C21,\"F\"),IF(T21=\"DC\",indice_femme_DC(H21),indice_femme_BP(H21)),0)),6))","v":""},null,null,null,null,{"$f":"IF(AND(L21=\"\",M21=\"\",N21=\"\"),\"\",calcul_total_DC(L21,M21,N21))","v":""},null,"",{"$f":"IF(O21=\"\",\"\",IF(EXACT(C21,\"M\"),niv_homme(T21,E21,H21,O21),IF(EXACT(C21,\"F\"),niv_femme(T21,E21,H21,O21))))","v":""},{"$f":"IF(O21=\"\",\"\",IF(EXACT(C21,\"M\"),niv_open_homme(T21,E21,H21,O21),IF(EXACT(C21,\"F\"),niv_open_femme(T21,E21,H21,O21),\" \")))","v":""},"DC",null,{"$f":"IF(EXACT(C21,\"M\"),calcul_age_A1(T21,D21),IF(EXACT(C21,\"F\"),calcul_age_A1(T21,D21),\"\"))","v":""},{"$f":"IF(O21=\"\",\"\",IF(EXACT(C21,\"M\"),niv_homme(T21,V21,H21,O21),IF(EXACT(C21,\"F\"),niv_femme(T21,V21,H21,O21))))","v":""}]
[null,null,null,null,{"$f":"IF(EXACT(C22,\"M\"),calcul_age(T22,D22),IF(EXACT(C22,\"F\"),calcul_age(T22,D22),\"\"))","v":""},null,null,null,{"$f":"IF(H22=\"\",\"\",IF(EXACT(C22,\"M\"),categorie_poids_homme(T22,E22,H22),IF(EXACT(C22,\"F\"),categorie_poids_femme(T22,E22,H22),\" \")))","v":""},{"$f":"IF(H22=\"\",\"\",ROUNDUP(IF(EXACT(C22,\"M\"),IF(T22=\"DC\",indice_homme_DC(H22),indice_homme_BP(H22)),IF(EXACT(C22,\"F\"),IF(T22=\"DC\",indice_femme_DC(H22),indice_femme_BP(H22)),0)),6))","v":""},null,null,null,null,{"$f":"IF(AND(L22=\"\",M22=\"\",N22=\"\"),\"\",calcul_total_DC(L22,M22,N22))","v":""},null,"",{"$f":"IF(O22=\"\",\"\",IF(EXACT(C22,\"M\"),niv_homme(T22,E22,H22,O22),IF(EXACT(C22,\"F\"),niv_femme(T22,E22,H22,O22))))","v":""},{"$f":"IF(O22=\"\",\"\",IF(EXACT(C22,\"M\"),niv_open_homme(T22,E22,H22,O22),IF(EXACT(C22,\"F\"),niv_open_femme(T22,E22,H22,O22),\" \")))","v":""},"DC",null,{"$f":"IF(EXACT(C22,\"M\"),calcul_age_A1(T22,D22),IF(EXACT(C22,\"F\"),calcul_age_A1(T22,D22),\"\"))","v":""},{"$f":"IF(O22=\"\",\"\",IF(EXACT(C22,\"M\"),niv_homme(T22,V22,H22,O22),IF(EXACT(C22,\"F\"),niv_femme(T22,V22,H22,O22))))","v":""}]
[null,null,null,null,{"$f":"IF(EXACT(C23,\"M\"),calcul_age(T23,D23),IF(EXACT(C23,\"F\"),calcul_age(T23,D23),\"\"))","v":""},null,null,null,{"$f":"IF(H23=\"\",\"\",IF(EXACT(C23,\"M\"),categorie_poids_homme(T23,E23,H23),IF(EXACT(C23,\"F\"),categorie_poids_femme(T23,E23,H23),\" \")))","v":""},{"$f":"IF(H23=\"\",\"\",ROUNDUP(IF(EXACT(C23,\"M\"),IF(T23=\"DC\",indice_homme_DC(H23),indice_homme_BP(H23)),IF(EXACT(C23,\"F\"),IF(T23=\"DC\",indice_femme_DC(H23),indice_femme_BP(H23)),0)),6))","v":""},null,null,null,null,{"$f":"IF(AND(L23=\"\",M23=\"\",N23=\"\"),\"\",calcul_total_DC(L23,M23,N23))","v":""},null,"",{"$f":"IF(O23=\"\",\"\",IF(EXACT(C23,\"M\"),niv_homme(T23,E23,H23,O23),IF(EXACT(C23,\"F\"),niv_femme(T23,E23,H23,O23))))","v":""},{"$f":"IF(O23=\"\",\"\",IF(EXACT(C23,\"M\"),niv_open_homme(T23,E23,H23,O23),IF(EXACT(C23,\"F\"),niv_open_femme(T23,E23,H23,O23),\" \")))","v":""},"DC",null,{"$f":"IF(EXACT(C23,\"M\"),calcul_age_A1(T23,D23),IF(EXACT(C23,\"F\"),calcul_age_A1(T23,D23),\"\"))","v":""},{"$f":"IF(O23=\"\",\"\",IF(EXACT(C23,\"M\"),niv_homme(T23,V23,H23,O23),IF(EXACT(C23,\"F\"),niv_femme(T23,V23,H23,O23))))","v":""}]
[null,null,null,null,{"$f":"IF(EXACT(C24,\"M\"),calcul_age(T24,D24),IF(EXACT(C24,\"F\"),calcul_age(T24,D24),\"\"))","v":""},null,null,null,{"$f":"IF(H24=\"\",\"\",IF(EXACT(C24,\"M\"),categorie_poids_homme(T24,E24,H24),IF(EXACT(C24,\"F\"),categorie_poids_femme(T24,E24,H24),\" \")))","v":""},{"$f":"IF(H24=\"\",\"\",ROUNDUP(IF(EXACT(C24,\"M\"),IF(T24=\"DC\",indice_homme_DC(H24),indice_homme_BP(H24)),IF(EXACT(C24,\"F\"),IF(T24=\"DC\",indice_femme_DC(H24),indice_femme_BP(H24)),0)),6))","v":""},null,null,null,null,{"$f":"IF(AND(L24=\"\",M24=\"\",N24=\"\"),\"\",calcul_total_DC(L24,M24,N24))","v":""},null,"",{"$f":"IF(O24=\"\",\"\",IF(EXACT(C24,\"M\"),niv_homme(T24,E24,H24,O24),IF(EXACT(C24,\"F\"),niv_femme(T24,E24,H24,O24))))","v":""},{"$f":"IF(O24=\"\",\"\",IF(EXACT(C24,\"M\"),niv_open_homme(T24,E24,H24,O24),IF(EXACT(C24,\"F\"),niv_open_femme(T24,E24,H24,O24),\" \")))","v":""},"DC",null,{"$f":"IF(EXACT(C24,\"M\"),calcul_age_A1(T24,D24),IF(EXACT(C24,\"F\"),calcul_age_A1(T24,D24),\"\"))","v":""},{"$f":"IF(O24=\"\",\"\",IF(EXACT(C24,\"M\"),niv_homme(T24,V24,H24,O24),IF(EXACT(C24,\"F\"),niv_femme(T24,V24,H24,O24))))","v":""}]
[null,null,null,null,{"$f":"IF(EXACT(C25,\"M\"),calcul_age(T25,D25),IF(EXACT(C25,\"F\"),calcul_age(T25,D25),\"\"))","v":""},null,null,null,{"$f":"IF(H25=\"\",\"\",IF(EXACT(C25,\"M\"),categorie_poids_homme(T25,E25,H25),IF(EXACT(C25,\"F\"),categorie_poids_femme(T25,E25,H25),\" \")))","v":""},{"$f":"IF(H25=\"\",\"\",ROUNDUP(IF(EXACT(C25,\"M\"),IF(T25=\"DC\",indice_homme_DC(H25),indice_homme_BP(H25)),IF(EXACT(C25,\"F\"),IF(T25=\"DC\",indice_femme_DC(H25),indice_femme_BP(H25)),0)),6))","v":""},null,null,null,null,{"$f":"IF(AND(L25=\"\",M25=\"\",N25=\"\"),\"\",calcul_total_DC(L25,M25,N25))","v":""},null,"",{"$f":"IF(O25=\"\",\"\",IF(EXACT(C25,\"M\"),niv_homme(T25,E25,H25,O25),IF(EXACT(C25,\"F\"),niv_femme(T25,E25,H25,O25))))","v":""},{"$f":"IF(O25=\"\",\"\",IF(EXACT(C25,\"M\"),niv_open_homme(T25,E25,H25,O25),IF(EXACT(C25,\"F\"),niv_open_femme(T25,E25,H25,O25),\" \")))","v":""},"DC",null,{"$f":"IF(EXACT(C25,\"M\"),calcul_age_A1(T25,D25),IF(EXACT(C25,\"F\"),calcul_age_A1(T25,D25),\"\"))","v":""},{"$f":"IF(O25=\"\",\"\",IF(EXACT(C25,\"M\"),niv_homme(T25,V25,H25,O25),IF(EXACT(C25,\"F\"),niv_femme(T25,V25,H25,O25))))","v":""}]
[null,null,null,null,{"$f":"IF(EXACT(C26,\"M\"),calcul_age(T26,D26),IF(EXACT(C26,\"F\"),calcul_age(T26,D26),\"\"))","v":""},null,null,null,{"$f":"IF(H26=\"\",\"\",IF(EXACT(C26,\"M\"),categorie_poids_homme(T26,E26,H26),IF(EXACT(C26,\"F\"),categorie_poids_femme(T26,E26,H26),\" \")))","v":""},{"$f":"IF(H26=\"\",\"\",ROUNDUP(IF(EXACT(C26,\"M\"),IF(T26=\"DC\",indice_homme_DC(H26),indice_homme_BP(H26)),IF(EXACT(C26,\"F\"),IF(T26=\"DC\",indice_femme_DC(H26),indice_femme_BP(H26)),0)),6))","v":""},null,null,null,null,{"$f":"IF(AND(L26=\"\",M26=\"\",N26=\"\"),\"\",calcul_total_DC(L26,M26,N26))","v":""},null,"",{"$f":"IF(O26=\"\",\"\",IF(EXACT(C26,\"M\"),niv_homme(T26,E26,H26,O26),IF(EXACT(C26,\"F\"),niv_femme(T26,E26,H26,O26))))","v":""},{"$f":"IF(O26=\"\",\"\",IF(EXACT(C26,\"M\"),niv_open_homme(T26,E26,H26,O26),IF(EXACT(C26,\"F\"),niv_open_femme(T26,E26,H26,O26),\" \")))","v":""},"DC",null,{"$f":"IF(EXACT(C26,\"M\"),calcul_age_A1(T26,D26),IF(EXACT(C26,\"F\"),calcul_age_A1(T26,D26),\"\"))","v":""},{"$f":"IF(O26=\"\",\"\",IF(EXACT(C26,\"M\"),niv_homme(T26,V26,H26,O26),IF(EXACT(C26,\"F\"),niv_femme(T26,V26,H26,O26))))","v":""}]
[null,null,null,null,{"$f":"IF(EXACT(C27,\"M\"),calcul_age(T27,D27),IF(EXACT(C27,\"F\"),calcul_age(T27,D27),\"\"))","v":""},null,null,null,{"$f":"IF(H27=\"\",\"\",IF(EXACT(C27,\"M\"),categorie_poids_homme(T27,E27,H27),IF(EXACT(C27,\"F\"),categorie_poids_femme(T27,E27,H27),\" \")))","v":""},{"$f":"IF(H27=\"\",\"\",ROUNDUP(IF(EXACT(C27,\"M\"),IF(T27=\"DC\",indice_homme_DC(H27),indice_homme_BP(H27)),IF(EXACT(C27,\"F\"),IF(T27=\"DC\",indice_femme_DC(H27),indice_femme_BP(H27)),0)),6))","v":""},null,null,null,null,{"$f":"IF(AND(L27=\"\",M27=\"\",N27=\"\"),\"\",calcul_total_DC(L27,M27,N27))","v":""},null,"",{"$f":"IF(O27=\"\",\"\",IF(EXACT(C27,\"M\"),niv_homme(T27,E27,H27,O27),IF(EXACT(C27,\"F\"),niv_femme(T27,E27,H27,O27))))","v":""},{"$f":"IF(O27=\"\",\"\",IF(EXACT(C27,\"M\"),niv_open_homme(T27,E27,H27,O27),IF(EXACT(C27,\"F\"),niv_open_femme(T27,E27,H27,O27),\" \")))","v":""},"DC",null,{"$f":"IF(EXACT(C27,\"M\"),calcul_age_A1(T27,D27),IF(EXACT(C27,\"F\"),calcul_age_A1(T27,D27),\"\"))","v":""},{"$f":"IF(O27=\"\",\"\",IF(EXACT(C27,\"M\"),niv_homme(T27,V27,H27,O27),IF(EXACT(C27,\"F\"),niv_femme(T27,V27,H27,O27))))","v":""}]
[null,null,null,null,{"$f":"IF(EXACT(C28,\"M\"),calcul_age(T28,D28),IF(EXACT(C28,\"F\"),calcul_age(T28,D28),\"\"))","v":""},null,null,null,{"$f":"IF(H28=\"\",\"\",IF(EXACT(C28,\"M\"),categorie_poids_homme(T28,E28,H28),IF(EXACT(C28,\"F\"),categorie_poids_femme(T28,E28,H28),\" \")))","v":""},{"$f":"IF(H28=\"\",\"\",ROUNDUP(IF(EXACT(C28,\"M\"),IF(T28=\"DC\",indice_homme_DC(H28),indice_homme_BP(H28)),IF(EXACT(C28,\"F\"),IF(T28=\"DC\",indice_femme_DC(H28),indice_femme_BP(H28)),0)),6))","v":""},null,null,null,null,{"$f":"IF(AND(L28=\"\",M28=\"\",N28=\"\"),\"\",calcul_total_DC(L28,M28,N28))","v":""},null,"",{"$f":"IF(O28=\"\",\"\",IF(EXACT(C28,\"M\"),niv_homme(T28,E28,H28,O28),IF(EXACT(C28,\"F\"),niv_femme(T28,E28,H28,O28))))","v":""},{"$f":"IF(O28=\"\",\"\",IF(EXACT(C28,\"M\"),niv_open_homme(T28,E28,H28,O28),IF(EXACT(C28,\"F\"),niv_open_femme(T28,E28,H28,O28),\" \")))","v":""},"DC",null,{"$f":"IF(EXACT(C28,\"M\"),calcul_age_A1(T28,D28),IF(EXACT(C28,\"F\"),calcul_age_A1(T28,D28),\"\"))","v":""},{"$f":"IF(O28=\"\",\"\",IF(EXACT(C28,\"M\"),niv_homme(T28,V28,H28,O28),IF(EXACT(C28,\"F\"),niv_femme(T28,V28,H28,O28))))","v":""}]
[]
["OBSERVATIONS et DIVERS :",null,null,null,null,"Secrétaire",null,"1er Assesseur",null,null,null,"Chef de Plateau",null,null,null,null,"2eme Assesseur"]

{"sheet":"Engagements","index":1,"n_rows":119,"n_cols":10,"rows_kept":119,"cut":false,"hidden":false,"merged":[[96,6,96,7],[114,1,114,4],[114,6,114,7],[116,6,116,7],[98,6,98,7],[102,1,102,4],[102,6,102,7],[104,6,104,7],[110,6,110,7],[108,6,108,7],[108,1,108,4],[98,1,98,4],[104,1,104,4],[110,1,110,4],[116,1,116,4],[96,1,96,4],[84,6,84,7],[86,6,86,7],[90,1,90,4],[90,6,90,7],[92,6,92,7],[86,1,86,4],[92,1,92,4],[84,1,84,4],[74,6,74,7],[68,6,68,7],[78,1,78,4],[78,6,78,7],[80,6,80,7],[74,1,74,4],[80,1,80,4],[62,6,62,7],[66,1,66,4],[66,6,66,7],[72,1,72,4],[72,6,72,7],[62,1,62,4],[68,1,68,4],[56,6,56,7],[56,1,56,4],[50,1,50,4],[60,1,60,4],[60,6,60,7],[48,1,48,4],[48,6,48,7],[50,6,50,7],[54,1,54,4],[54,6,54,7],[38,6,38,7],[42,1,42,4],[42,6,42,7],[44,6,44,7],[38,1,38,4],[44,1,44,4],[32,6,32,7],[26,1,26,4],[32,1,32,4],[36,1,36,4],[36,6,36,7],[24,1,24,4],[24,6,24,7],[26,6,26,7],[30,1,30,4],[30,6,30,7],[20,6,20,7],[12,1,12,4],[12,6,12,7],[14,6,14,7],[14,1,14,4],[20,1,20,4],[8,6,8,7],[8,1,8,4],[2,1,2,4],[18,1,18,4],[18,6,18,7],[0,1,0,4],[0,6,0,7],[2,6,2,7],[6,1,6,4],[6,6,6,7]]}
["NOM :",{"$f":"DC!F$9","v":"x"},null,null,null,"Prénom :",{"$f":"DC!G$9","v":"x"},null,"N° tirage au sort :",{"$f":"DC!K9","v":0}]
["discipline",{"$f":"DC!T$9","v":"DC"},"Sexe :    ",{"$f":"DC!C$9","v":"F"},"Date de naissance : ",{"$f":"DC!D$9","v":"1999-02-01"},"Catégorie d'âge :",{"$f":"DC!E$9","v":"SNR"}," Visa de l'athlète :"]
["Club :",{"$f":"DC!A$9","v":"xx"},null,null,null,"licence :",{"$f":"DC!G$9","v":"x"}]
["Poids de corps :",null,null,"Barre de départ","1er essai","2° essai","3° essai","Modif 3° essai","Modif  3° essai","Résultat"]
["H support","H sécurité","Cales                                 "]
[]
["NOM :",{"$f":"DC!F$10","v":0},null,null,null,"Prénom :",{"$f":"DC!G$10","v":0},null,"N° tirage au sort :",{"$f":"DC!K10","v":0}]
["discipline",{"$f":"DC!T$10","v":"DC"},"Sexe :    ",{"$f":"DC!C$10","v":0},"Date de naissance : ",{"$f":"DC!D$10","v":"00:00:00"},"Catégorie d'âge :",{"$f":"DC!E$10","v":""}," Visa de l'athlète :"]
["Club :",{"$f":"DC!B$10","v":0},null,null,null,"licence :",{"$f":"DC!A$10","v":0}]
["Poids de corps :",null,null,"Barre de départ","1er essai","2° essai","3° essai","Modif 3° essai","Modif  3° essai","Résultat"]
["H support","H sécurité","Cales                                 "]
[]
["NOM :",{"$f":"DC!F$11","v":0},null,null,null,"Prénom :",{"$f":"DC!G$11","v":0},null,"N° tirage au sort :",{"$f":"DC!K11","v":0}]
["discipline",{"$f":"DC!T$11","v":"DC"},"Sexe :    ",{"$f":"DC!C$11","v":0},"Date de naissance : ",{"$f":"DC!D$11","v":"00:00:00"},"Catégorie d'âge :",{"$f":"DC!E$11","v":""}," Visa de l'athlète :"]
["Club :",{"$f":"DC!B$11","v":0},null,null,null,"licence :",{"$f":"DC!A$11","v":0}]
["Poids de corps :",null,null,"Barre de départ","1er essai","2° essai","3° essai","Modif 3° essai","Modif  3° essai","Résultat"]
["H support","H sécurité","Cales                                 "]
[]
["NOM :",{"$f":"DC!F$12","v":0},null,null,null,"Prénom :",{"$f":"DC!G$12","v":0},null,"N° tirage au sort :",{"$f":"DC!K12","v":0}]
["discipline",{"$f":"DC!T$12","v":"DC"},"Sexe :    ",{"$f":"DC!C$12","v":0},"Date de naissance : ",{"$f":"DC!D$12","v":"00:00:00"},"Catégorie d'âge :",{"$f":"DC!E$12","v":""}," Visa de l'athlète :"]
["Club :",{"$f":"DC!B$12","v":0},null,null,null,"licence :",{"$f":"DC!A$12","v":0}]
["Poids de corps :",null,null,"Barre de départ","1er essai","2° essai","3° essai","Modif 3° essai","Modif  3° essai","Résultat"]
["H support","H sécurité","Cales                                 "]
[]
["NOM :",{"$f":"DC!F$13","v":0},null,null,null,"Prénom :",{"$f":"DC!G$13","v":0},null,"N° tirage au sort :",{"$f":"DC!K13","v":0}]
["discipline",{"$f":"DC!T$13","v":"DC"},"Sexe :    ",{"$f":"DC!C$13","v":0},"Date de naissance : ",{"$f":"DC!D$13","v":"00:00:00"},"Catégorie d'âge :",{"$f":"DC!E$13","v":""}," Visa de l'athlète :"]
["Club :",{"$f":"DC!B$13","v":0},null,null,null,"licence :",{"$f":"DC!A$13","v":0}]
["Poids de corps :",null,null,"Barre de départ","1er essai","2° essai","3° essai","Modif 3° essai","Modif  3° essai","Résultat"]
["H support","H sécurité","Cales                                 "]
[]
["NOM :",{"$f":"DC!F$14","v":0},null,null,null,"Prénom :",{"$f":"DC!G$14","v":0},null,"N° tirage au sort :",{"$f":"DC!K14","v":0}]
["discipline",{"$f":"DC!T$14","v":"DC"},"Sexe :    ",{"$f":"DC!C$14","v":0},"Date de naissance : ",{"$f":"DC!D$14","v":"00:00:00"},"Catégorie d'âge :",{"$f":"DC!E$14","v":""}," Visa de l'athlète :"]
["Club :",{"$f":"DC!B$14","v":0},null,null,null,"licence :",{"$f":"DC!A$14","v":0}]
["Poids de corps :",null,null,"Barre de départ","1er essai","2° essai","3° essai","Modif 3° essai","Modif  3° essai","Résultat"]
["H support","H sécurité","Cales                                 "]
[]
["NOM :",{"$f":"DC!F$15","v":0},null,null,null,"Prénom :",{"$f":"DC!G$15","v":0},null,"N° tirage au sort :",{"$f":"DC!K15","v":0}]
["discipline",{"$f":"DC!T$15","v":"DC"},"Sexe :    ",{"$f":"DC!C$15","v":0},"Date de naissance : ",{"$f":"DC!D$15","v":"00:00:00"},"Catégorie d'âge :",{"$f":"DC!E$15","v":""}," Visa de l'athlète :"]
["Club :",{"$f":"DC!B$15","v":0},null,null,null,"licence :",{"$f":"DC!A$15","v":0}]
["Poids de corps :",null,null,"Barre de départ","1er essai","2° essai","3° essai","Modif 3° essai","Modif  3° essai","Résultat"]
["H support","H sécurité","Cales                                 "]
[]
["NOM :",{"$f":"DC!F$16","v":0},null,null,null,"Prénom :",{"$f":"DC!G$16","v":0},null,"N° tirage au sort :",{"$f":"DC!K16","v":0}]
["discipline",{"$f":"DC!T$16","v":"DC"},"Sexe :    ",{"$f":"DC!C$16","v":0},"Date de naissance : ",{"$f":"DC!D$16","v":"00:00:00"},"Catégorie d'âge :",{"$f":"DC!E$16","v":""}," Visa de l'athlète :"]
["Club :",{"$f":"DC!B$16","v":0},null,null,null,"licence :",{"$f":"DC!A$16","v":0}]
["Poids de corps :",null,null,"Barre de départ","1er essai","2° essai","3° essai","Modif 3° essai","Modif  3° essai","Résultat"]
["H support","H sécurité","Cales                                 "]
[]
["NOM :",{"$f":"DC!F$17","v":0},null,null,null,"Prénom :",{"$f":"DC!G$17","v":0},null,"N° tirage au sort :",{"$f":"DC!K17","v":0}]
["discipline",{"$f":"DC!T$17","v":"DC"},"Sexe :    ",{"$f":"DC!C$17","v":0},"Date de naissance : ",{"$f":"DC!D$17","v":"00:00:00"},"Catégorie d'âge :",{"$f":"DC!E$17","v":""}," Visa de l'athlète :"]
["Club :",{"$f":"DC!B$17","v":0},null,null,null,"licence :",{"$f":"DC!A$17","v":0}]
["Poids de corps :",null,null,"Barre de départ","1er essai","2° essai","3° essai","Modif 3° essai","Modif  3° essai","Résultat"]
["H support","H sécurité","Cales                                 "]
[]
["NOM :",{"$f":"DC!F$18","v":0},null,null,null,"Prénom :",{"$f":"DC!G$18","v":0},null,"N° tirage au sort :",{"$f":"DC!K18","v":0}]
["discipline",{"$f":"DC!T$18","v":"DC"},"Sexe :    ",{"$f":"DC!C$18","v":0},"Date de naissance : ",{"$f":"DC!D$18","v":"00:00:00"},"Catégorie d'âge :",{"$f":"DC!E$18","v":""}," Visa de l'athlète :"]
["Club :",{"$f":"DC!B$18","v":0},null,null,null,"licence :",{"$f":"DC!A$18","v":0}]
["Poids de corps :",null,null,"Barre de départ","1er essai","2° essai","3° essai","Modif 3° essai","Modif  3° essai","Résultat"]
["H support","H sécurité","Cales                                 "]
[]
["NOM :",{"$f":"DC!F$19","v":0},null,null,null,"Prénom :",{"$f":"DC!G$19","v":0},null,"N° tirage au sort :",{"$f":"DC!K19","v":0}]
["discipline",{"$f":"DC!T$19","v":"DC"},"Sexe :    ",{"$f":"DC!C$19","v":0},"Date de naissance : ",{"$f":"DC!D$19","v":"00:00:00"},"Catégorie d'âge :",{"$f":"DC!E$19","v":""}," Visa de l'athlète :"]
["Club :",{"$f":"DC!B$19","v":0},null,null,null,"licence :",{"$f":"DC!A$19","v":0}]
["Poids de corps :",null,null,"Barre de départ","1er essai","2° essai","3° essai","Modif 3° essai","Modif  3° essai","Résultat"]
["H support","H sécurité","Cales                                 "]
[]
["NOM :",{"$f":"DC!F$20","v":0},null,null,null,"Prénom :",{"$f":"DC!G$20","v":0},null,"N° tirage au sort :",{"$f":"DC!K20","v":0}]
["discipline",{"$f":"DC!T$20","v":"DC"},"Sexe :    ",{"$f":"DC!C$20","v":0},"Date de naissance : ",{"$f":"DC!D$20","v":"00:00:00"},"Catégorie d'âge :",{"$f":"DC!E$20","v":""}," Visa de l'athlète :"]
["Club :",{"$f":"DC!B$20","v":0},null,null,null,"licence :",{"$f":"DC!A$20","v":0}]
["Poids de corps :",null,null,"Barre de départ","1er essai","2° essai","3° essai","Modif 3° essai","Modif  3° essai","Résultat"]
["H support","H sécurité","Cales                                 "]
[]
["NOM :",{"$f":"DC!F$21","v":0},null,null,null,"Prénom :",{"$f":"DC!G$21","v":0},null,"N° tirage au sort :",{"$f":"DC!K21","v":0}]
["discipline",{"$f":"DC!T$21","v":"DC"},"Sexe :    ",{"$f":"DC!C$21","v":0},"Date de naissance : ",{"$f":"DC!D$21","v":"00:00:00"},"Catégorie d'âge :",{"$f":"DC!E$21","v":""}," Visa de l'athlète :"]
["Club :",{"$f":"DC!B$21","v":0},null,null,null,"licence :",{"$f":"DC!A$21","v":0}]
["Poids de corps :",null,null,"Barre de départ","1er essai","2° essai","3° essai","Modif 3° essai","Modif  3° essai","Résultat"]
["H support","H sécurité","Cales                                 "]
[]
["NOM :",{"$f":"DC!F$22","v":0},null,null,null,"Prénom :",{"$f":"DC!G$22","v":0},null,"N° tirage au sort :",{"$f":"DC!K22","v":0}]
["discipline",{"$f":"DC!T$22","v":"DC"},"Sexe :    ",{"$f":"DC!C$22","v":0},"Date de naissance : ",{"$f":"DC!D$22","v":"00:00:00"},"Catégorie d'âge :",{"$f":"DC!E$22","v":""}," Visa de l'athlète :"]
["Club :",{"$f":"DC!B$22","v":0},null,null,null,"licence :",{"$f":"DC!A$22","v":0}]
["Poids de corps :",null,null,"Barre de départ","1er essai","2° essai","3° essai","Modif 3° essai","Modif  3° essai","Résultat"]
["H support","H sécurité","Cales                                 "]
[]
["NOM :",{"$f":"DC!F$23","v":0},null,null,null,"Prénom :",{"$f":"DC!G$23","v":0},null,"N° tirage au sort :",{"$f":"DC!K23","v":0}]
["discipline",{"$f":"DC!T$23","v":"DC"},"Sexe :    ",{"$f":"DC!C$23","v":0},"Date de naissance : ",{"$f":"DC!D$23","v":"00:00:00"},"Catégorie d'âge :",{"$f":"DC!E$23","v":""}," Visa de l'athlète :"]
["Club :",{"$f":"DC!B$23","v":0},null,null,null,"licence :",{"$f":"DC!A$23","v":0}]
["Poids de corps :",null,null,"Barre de départ","1er essai","2° essai","3° essai","Modif 3° essai","Modif  3° essai","Résultat"]
["H support","H sécurité","Cales                                 "]
[]
["NOM :",{"$f":"DC!F$24","v":0},null,null,null,"Prénom :",{"$f":"DC!G$24","v":0},null,"N° tirage au sort :",{"$f":"DC!K24","v":0}]
["discipline",{"$f":"DC!T$24","v":"DC"},"Sexe :    ",{"$f":"DC!C$24","v":0},"Date de naissance : ",{"$f":"DC!D$24","v":"00:00:00"},"Catégorie d'âge :",{"$f":"DC!E$24","v":""}," Visa de l'athlète :"]
["Club :",{"$f":"DC!B$24","v":0},null,null,null,"licence :",{"$f":"DC!A$24","v":0}]
["Poids de corps :",null,null,"Barre de départ","1er essai","2° essai","3° essai","Modif 3° essai","Modif  3° essai","Résultat"]
["H support","H sécurité","Cales                                 "]
[]
["NOM :",{"$f":"DC!F$25","v":0},null,null,null,"Prénom :",{"$f":"DC!G$25","v":0},null,"N° tirage au sort :",{"$f":"DC!K25","v":0}]
["discipline",{"$f":"DC!T$25","v":"DC"},"Sexe :    ",{"$f":"DC!C$25","v":0},"Date de naissance : ",{"$f":"DC!D$25","v":"00:00:00"},"Catégorie d'âge :",{"$f":"DC!E$25","v":""}," Visa de l'athlète :"]
["Club :",{"$f":"DC!B$25","v":0},null,null,null,"licence :",{"$f":"DC!A$25","v":0}]
["Poids de corps :",null,null,"Barre de départ","1er essai","2° essai","3° essai","Modif 3° essai","Modif  3° essai","Résultat"]
["H support","H sécurité","Cales                                 "]
[]
["NOM :",{"$f":"DC!F$26","v":0},null,null,null,"Prénom :",{"$f":"DC!G$26","v":0},null,"N° tirage au sort :",{"$f":"DC!K26","v":0}]
["discipline",{"$f":"DC!T$26","v":"DC"},"Sexe :    ",{"$f":"DC!C$26","v":0},"Date de naissance : ",{"$f":"DC!D$26","v":"00:00:00"},"Catégorie d'âge :",{"$f":"DC!E$26","v":""}," Visa de l'athlète :"]
["Club :",{"$f":"DC!B$26","v":0},null,null,null,"licence :",{"$f":"DC!A$26","v":0}]
["Poids de corps :",null,null,"Barre de départ","1er essai","2° essai","3° essai","Modif 3° essai","Modif  3° essai","Résultat"]
["H support","H sécurité","Cales                                 "]
[]
["NOM :",{"$f":"DC!F$27","v":0},null,null,null,"Prénom :",{"$f":"DC!G$27","v":0},null,"N° tirage au sort :",{"$f":"DC!K27","v":0}]
["discipline",{"$f":"DC!T$27","v":"DC"},"Sexe :    ",{"$f":"DC!C$27","v":0},"Date de naissance : ",{"$f":"DC!D$27","v":"00:00:00"},"Catégorie d'âge :",{"$f":"DC!E$27","v":""}," Visa de l'athlète :"]
["Club :",{"$f":"DC!B$27","v":0},null,null,null,"licence :",{"$f":"DC!A$27","v":0}]
["Poids de corps :",null,null,"Barre de départ","1er essai","2° essai","3° essai","Modif 3° essai","Modif  3° essai","Résultat"]
["H support","H sécurité","Cales                                 "]
[]
["NOM :",{"$f":"DC!F$28","v":0},null,null,null,"Prénom :",{"$f":"DC!G$28","v":0},null,"N° tirage au sort :",{"$f":"DC!K28","v":0}]
["discipline",{"$f":"DC!T$28","v":"DC"},"Sexe :    ",{"$f":"DC!C$28","v":0},"Date de naissance : ",{"$f":"DC!D$28","v":"00:00:00"},"Catégorie d'âge :",{"$f":"DC!E$28","v":""}," Visa de l'athlète :"]
["Club :",{"$f":"DC!B$28","v":0},null,null,null,"licence :",{"$f":"DC!A$28","v":0}]
["Poids de corps :",null,null,"Barre de départ","1er essai","2° essai","3° essai","Modif 3° essai","Modif  3° essai","Résultat"]
["H support","H sécurité","Cales                                 "]

{"sheet":"Niv DC","index":2,"n_rows":81,"n_cols":16,"rows_kept":81,"cut":false,"hidden":false,"merged":[[0,0,0,11],[1,0,1,11],[3,0,3,4],[3,8,3,12],[15,0,15,6],[15,8,15,14],[60,0,60,4],[60,8,60,12],[71,0,71,4],[71,8,71,12],[27,0,27,6],[27,8,27,14],[38,0,38,4],[38,8,38,12],[49,0,49,4],[49,8,49,12]]}
["NIVEAUX  DEVELOPPE COUCHE"]
["A la date du 14 Mars 2024"]
[null,"les performances inferieures au niveau régionale sont classées par défaut comme niveau départemental"]
["SJR masculin",null,null,null,null,null,null,null,"SJR féminine"]
["Catég.","R3","R2","R1","N2","N1",null,null,"Catég.","R3","R2","R1","N2","N1"]
[53,35,42.5,50,57.5,62.5,null,null,43,20,25,30,35,37.5]
[59,40,47.5,55,62.5,67.5,null,null,47,20,27.5,32.5,37.5,42.5]
[66,47.5,57.5,67.5,77.5,82.5,null,null,52,22.5,30,35,40,45]
[74,57.5,67.5,80,90,95,null,null,57,25,32.5,37.5,42.5,47.5]
[83,62.5,72.5,85,95,100,null,null,63,27.5,35,42.5,47.5,52.5]
[93,67.5,80,92.5,100,105,null,null,69,30,37.5,47.5,52.5,57.5]
[105,72.5,85,97.5,112.5,120,null,null,76,32.5,42.5,50,55,60]
[120,80,92.5,107.5,115,122.5,null,null,84,35,45,55,60,67.5]
["120 +",85,97.5,112.5,120,127.5,null,null,"84+",37.5,50,60,70,75]
[]
["JR masculin",null,null,null,null,null,null,null,"JR féminine"]
["Catég.","R3","R2","R1","N2","N1","Europe","Monde","Catég.","R3","R2","R1","N2","N1","Europe","Monde"]
[53,45,52.5,72.5,85,92.5,100,115,43,22.5,30,35,40,42.5,57.5,67.5]
[59,52.5,67.5,80,95,100,115,130,47,22.5,32.5,40,47.5,50,65,72.5]
[66,57.5,75,87.5,102.5,110,135,150,52,25,35,45,52.5,55,70,77.5]
[74,62.5,87.5,102.5,120,135,150,165,57,27.5,37.5,47.5,55,60,75,82.5]
[83,67.5,92.5,112.5,132.5,150,160,170,63,30,40,50,57.5,62.5,77.5,87.5]
[93,75,105,125,147.5,155,165,185,69,32.5,45,55,62.5,67.5,80,95]
[105,77.5,110,130,155,160,180,190,76,35,50,60,70,75,85,100]
[120,80,112.5,135,160,165,185,195,84,37.5,55,65,77.5,80,90,105]
["120 +",82.5,115,140,165,172.5,190,200,"84+",40,57.5,70,80,85,95,110]
[null,"les performances inferieures au niveau régionale sont classées par défaut comme niveau départemental"]
["SNR masculin",null,null,null,null,null,null,null,"SNR féminine"]
["Catég.","R3","R2","R1","N2","N1","Europe","Monde","Catég.","R3","R2","R1","N2","N1","Europe","Monde"]
[59,55,77.5,92.5,110,112.5,135,150,47,25,35,42.5,52.5,55,72.5,80]
[66,65,90,110,130,135,150,165,52,27.5,37.5,45,55,57.5,80,90]
[74,72.5,102.5,125,147.5,150,170,180,57,30,40,47.5,57.5,62.5,87.5,100]
[83,82.5,115,140,162.5,165,185,195,63,32.5,45,52.5,65,75,95,105]
[93,87.5,122.49999999999999,150,175,180,195,207.5,69,35,47.5,57.5,70,77.5,100,110]
[105,92.5,130,157.5,185,190,210,220,76,37.5,52.5,62.5,75,80,105,115]
[120,100,140,170,200,205,220,230,84,42.5,57.5,70,80,85,110,120]
["120 +",107.5,150,182.5,215,220,235,245,"84+",45,62.5,77.5,85,90,120,130]
[null,"les performances inferieures au niveau régionale sont classées par défaut comme niveau départemental"]
["M1 masculin",null,null,null,null,null,null,null,"M1 féminine"]
["Catég.","R3","R2","R1","N2","N1",null,null,"Catég.","R3","R2","R1","N2","N1"]
[59,47.5,67.5,80,{"$f":"(D41+F41)/2","v":87.5},95,null,null,47,20,27.5,35,{"$f":"(L41+N41)/2","v":37.5},40]
[66,55,77.5,95,{"$f":"(D42+F42)/2","v":102.5},110,null,null,52,22.5,30,35,40,45]
[74,62.5,87.5,107.5,115,125,null,null,57,25,35,40,45,50]
[83,70,100,120,130,140,null,null,63,27.5,37.5,45,50,55]
[93,77.5,110,130,140,152.5,null,null,69,30,40,47.5,52.5,57.5]
[105,82.5,117.5,140,150,162.5,null,null,76,32.5,42.5,50,55,60]
[120,90,127.5,150,162.5,175,null,null,84,35,50,60,{"$f":"(L47+N47)/2","v":65},70]
["120 +",100,140,170,185,200,null,null,"84 +",37.5,55,65,72.5,77.5]
[null,"les performances inferieures au niveau régionale sont classées par défaut comme niveau départemental"]
["M2 masculin",null,null,null,null,null,null,null,"M2 féminine"]
["Catég.","R3","R2","R1","N2","N1",null,null,"Catég.","R3","R2","R1","N2","N1"]
[59,42.5,60,72.5,80,85,null,null,47,20,25,27.5,32.5,35]
[66,47.5,67.5,80,87.5,95,null,null,52,20,27.5,30,{"$f":"(L53+N53)/2","v":35},40]
[74,57.5,80,97.5,107.5,115,null,null,57,22.5,30,35,40,45]
[83,62.5,87.5,107.5,117.5,125,null,null,63,25,32.5,37.5,42.5,47.5]
[93,67.5,97.5,117.5,127.5,137.5,null,null,69,27.5,35,40,45,50]
[105,77.5,107.5,130,140,152.5,null,null,76,30,37.5,42.5,47.5,52.5]
[120,85,117.5,142.5,152.5,162.5,null,null,84,32.5,40,50,55,57.5]
["120 +",92.5,127.5,155,165,172.5,null,null,"84 +",35,45,55,60,65]
[null,"les performances inferieures au niveau régionale sont classées par défaut comme niveau départemental"]
["M3 masculin",null,null,null,null,null,null,null,"M3 féminine"]
["Catég.","R3","R2","R1","N2","N1",null,null,"Catég.","R3","R2","R1","N2","N1"]
[59,37.5,50,62.5,67.5,72.5,null,null,47,20,22.5,25,30,32.5]
[66,42.5,60,72.5,80,85,null,null,52,22.5,25,27.5,32.5,35]
[74,47.5,67.5,80,90,95,null,null,57,25,27.5,30,35,37.5]
[83,52.5,75,90,100,105,null,null,63,27.5,30,32.5,37.5,40]
[93,60,85,102.5,110,115,null,null,69,30,32.5,35,40,45]
[105,62.5,87.5,107.5,115,120,null,null,76,32.5,35,37.5,42.5,47.5]
[120,67.5,92.5,112.5,122.5,130,null,null,84,35,37.5,42.5,47.5,52.5]
["120 +",70,97.5,117.5,127.5,135,null,null,"84 +",37.5,40,45,50,55]
[null,"les performances inferieures au niveau régionale sont classées par défaut comme niveau départemental"]
["M4 masculin",null,null,null,null,null,null,null,"M4 féminine"]
["Catég.","R3","R2","R1","N2","N1",null,null,"Catég.","R3","R2","R1","N2","N1"]
[59,32.5,45,55,57.5,62.5,null,null,47,20,22.5,25,27.5,30]
[66,35,50,60,65,70,null,null,52,22.5,25,27.5,30,32.5]
[74,40,55,65,72.5,77.5,null,null,57,25,27.5,30,32.5,35]
[83,45,62.5,77.5,85,90,null,null,63,27.5,30,32.5,35,37.5]
[93,50,70,85,90,95,null,null,69,30,32.5,35,37.5,40]
[105,52.5,72.5,90,95,100,null,null,76,32.5,35,37.5,40,42.5]
[120,55,77.5,92.5,100,105,null,null,84,35,37.5,40,42.5,45]
["120 +",57.5,80,97.5,105,110,null,null,"84 +",37.5,40,42.5,45,50]

{"sheet":"Niv BP","index":3,"n_rows":57,"n_cols":16,"rows_kept":57,"cut":false,"hidden":false,"merged":[[14,0,14,4],[14,8,14,12],[0,0,0,12],[1,0,1,12],[3,0,3,1],[3,8,3,9],[3,10,3,14],[3,2,3,6],[25,8,25,12],[25,0,25,4],[36,8,36,12],[36,0,36,4],[47,0,47,4],[47,8,47,12]]}
["NIVEAUX  BENCH PRESS"]
["A la date du 14 Janvier 2024"]
[null,"les performances inferieures au niveau régionale sont classées par défaut comme niveau départemental"]
["JR masculin",null,"SNR masculin",null,null,null,null,null,"JR féminine",null,"SNR féminine"]
["Catég.","R3","R2","R1","N2","N1","Europe","Monde","Catég.","R3","R2","R1","N2","N1","Europe","Monde"]
[59,65,90,110,120,130,167.5,180,47,30,42.5,50,55,60,87.5,92.5]
[66,72.5,100,125,135,145,190,205,52,32.5,45,55,60,65,100,110]
[74,82.5,115,140,155,165,222.5,232.5,57,35,47.5,57.5,62.5,67.5,110,120]
[83,92.5,130,157.5,170,185,242.5,260,63,37.5,50,60,67.5,72.5,120,130]
[93,100,140,170,185,200,265,275,69,40,57.5,67.5,75,80,135,140]
[105,110,155,187.5,205,220,275,300,76,42.5,62.5,75,80,87.5,142.5,155]
[120,120,167.5,205,220,240,300,320,84,47.5,67.5,80,90,95,160,170]
["120 +",125,175,212.5,235,250,320,330,"84 +",52.5,72.5,90,97.5,105,180,190]
[null,"les performances inferieures au niveau régionale sont classées par défaut comme niveau départemental"]
["M1 masculin",null,null,null,null,null,null,null,"M1 féminine"]
["Catég.","R3","R2","R1","N2","N1",null,null,"Catég.","R3","R2","R1","N2","N1"]
[59,57.5,80,97.5,105,115,null,null,47,25,35,42.5,47.5,50]
[66,65,90,110,120,130,null,null,52,27.5,37.5,45,50,55]
[74,75,105,127.5,140,150,null,null,57,30,40,47.5,52.5,57.5]
[83,85,120,145,160,170,null,null,63,32.5,42.5,50,55,60]
[93,90,125,152.5,167.5,180,null,null,69,35,45,55,60,65]
[105,100,140,170,185,200,null,null,76,37.5,47.5,57.5,65,67.5]
[120,107.5,150,182.5,200,215,null,null,84,40,52.5,62.5,70,75]
["120 +",115,160,195,210,230,null,null,"84 +",42.5,57.5,67.5,75,80]
[null,"les performances inferieures au niveau régionale sont classées par défaut comme niveau départemental"]
["M2 masculin",null,null,null,null,null,null,null,"M2 féminine"]
["Catég.","R3","R2","R1","N2","N1",null,null,"Catég.","R3","R2","R1","N2","N1"]
[59,55,77.5,92.5,100,110,null,null,47,22.5,32.5,37.5,42.5,45]
[66,60,85,102.5,110,120,null,null,52,25,35,42.5,47.5,50]
[74,67.5,95,115,125,135,null,null,57,27.5,37.5,45,50,52.5]
[83,77.5,110,130,135,155,null,null,63,30,40,47.5,52.5,55]
[93,85,120,145,155,170,null,null,69,32.5,42.5,50,55,60]
[105,95,132.5,162.5,170,190,null,null,76,35,45,52.5,60,62.5]
[120,100,140,170,190,200,null,null,84,37.5,47.5,60,65,70]
["120 +",105,147.5,180,195,210,null,null,"84 +",40,50,62.5,70,72.5]
[null,"les performances inferieures au niveau régionale sont classées par défaut comme niveau départemental"]
["M3 masculin",null,null,null,null,null,null,null,"M3 féminine"]
["Catég.","R3","R2","R1","N2","N1",null,null,"Catég.","R3","R2","R1","N2","N1"]
[59,50,70,85,95,100,null,null,47,20,30,35,37.5,42.5]
[66,55,77.5,92.5,105,110,null,null,52,22.5,32.5,37.5,42.5,45]
[74,60,85,102.5,112.5,120,null,null,57,25,35,40,45,47.5]
[83,65,90,110,120,127.5,null,null,63,27.5,37.5,42.5,47.5,50]
[93,70,100,120,130,140,null,null,69,30,40,45,50,52.5]
[105,75,105,127.5,140,150,null,null,76,32.5,42.5,47.5,52.5,55]
[120,77.5,110,132.5,145,155,null,null,84,35,45,52.5,57.5,62.5]
["120 +",80,115,137.5,150,160,null,null,"84 +",37.5,47.5,55,60,65]
[null,"les performances inferieures au niveau régionale sont classées par défaut comme niveau départemental"]
["M4 masculin",null,null,null,null,null,null,null,"M4 féminine"]
["Catég.","R3","R2","R1","N2","N1",null,null,"Catég.","R3","R2","R1","N2","N1"]
[59,42.5,60,70,75,82.5,null,null,47,25,27.5,32.5,35,40]
[66,45,62.5,75,85,90,null,null,52,27.5,30,35,37.5,42.5]
[74,50,70,85,90,95,null,null,57,30,32.5,37.5,40,45]
[83,52.5,72.5,90,95,100,null,null,63,32.5,35,40,42.5,47.5]
[93,57.5,80,97.5,105,110,null,null,69,35,40,42.5,45,50]
[105,60,85,102.5,110,115,null,null,76,37.5,42.5,45,50,52.5]
[120,62.5,87.5,105,115,120,null,null,84,40,45,50,52.5,55]
["120 +",65,90,110,120,125,null,null,"84 +",45,50,57.5,60,62.5]

{"sheet":"Cat. d'âge","index":4,"n_rows":90,"n_cols":13,"rows_kept":90,"cut":false,"hidden":false,"merged":[[0,0,0,4],[0,6,0,10],[2,0,2,1],[2,3,2,4],[2,6,2,7],[2,9,2,10]]}
["Catégories d'âge valables à partir du 01/01/2024 et jusqu'au 31/12/2024",null,null,null,null,null,"Catégories d'âge valables à partir du 01/01/2025 et jusqu'au 31/12/2025"]
[]
["Catégories d'âge Homme et Femme DC",null,null,"Catégories d'âge Homme et Femme BP",null,null,"Catégories d'âge Homme et Femme DC",null,null,"Catégories d'âge Homme et Femme BP",null,null,"Ligues"]
["Année de naissance","Catégorie",null,"Année de naissance","Catégorie",null,"Année de naissance","Catégorie",null,"Année de naissance","Catégorie"]
["2014-01-01","INTERDIT",null,"2014-01-01","INTERDIT",null,"2014-01-01","INTERDIT",null,"2014-01-01","INTERDIT",null,"AUVERGNE   RHONE-ALPES"]
["2013-01-01","INTERDIT",null,"2013-01-01","INTERDIT",null,"2013-01-01","INTERDIT",null,"2013-01-01","INTERDIT",null,"BOURGOGNE  FRANCHE-COMTE"]
["2012-01-01","INTERDIT",null,"2012-01-01","INTERDIT",null,"2012-01-01","INTERDIT",null,"2012-01-01","INTERDIT",null,"BRETAGNE"]
["2011-01-01","INTERDIT",null,"2011-01-01","INTERDIT",null,"2011-01-01","SJR",null,"2011-01-01","INTERDIT",null,"CENTRE-VAL DE LOIRE"]
["2010-01-01","SJR",null,"2010-01-01","INTERDIT",null,"2010-01-01","SJR",null,"2010-01-01","INTERDIT",null,"CORSE"]
["2009-01-01","SJR",null,"2009-01-01","INTERDIT",null,"2009-01-01","SJR",null,"2009-01-01","INTERDIT",null,"GRAND EST"]
["2008-01-01","SJR",null,"2008-01-01","INTERDIT",null,"2008-01-01","SJR",null,"2008-01-01","INTERDIT",null,"GUADELOUPE"]
["2007-01-01","SJR",null,"2007-01-01","INTERDIT",null,"2007-01-01","SJR",null,"2007-01-01","INTERDIT",null,"GUYANE"]
["2006-01-01","SJR",null,"2006-01-01","INTERDIT",null,"2006-01-01","JR",null,"2006-01-01","JR",null,"HAUTS DE FRANCE"]
["2005-01-01","JR",null,"2005-01-01","JR",null,"2005-01-01","JR",null,"2005-01-01","JR",null,"ILE DE FRANCE"]
["2004-01-01","JR",null,"2004-01-01","JR",null,"2004-01-01","JR",null,"2004-01-01","JR",null,"La REUNION"]
["2003-01-01","JR",null,"2003-01-01","JR",null,"2003-01-01","JR",null,"2003-01-01","JR",null,"LIGERIENNE"]
["2002-01-01","JR",null,"2002-01-01","JR",null,"2002-01-01","JR",null,"2002-01-01","JR",null,"MARTINIQUE"]
["2001-01-01","JR",null,"2001-01-01","JR",null,"2001-01-01","SNR",null,"2001-01-01","SNR",null,"MAYOTTE"]
["2000-01-01","SNR",null,"2000-01-01","SNR",null,"2000-01-01","SNR",null,"2000-01-01","SNR",null,"NOUVELLE AQUITAINE"]
["1999-01-01","SNR",null,"1999-01-01","SNR",null,"1999-01-01","SNR",null,"1999-01-01","SNR",null,"NOUVELLE CALEDONIE"]
["1998-01-01","SNR",null,"1998-01-01","SNR",null,"1998-01-01","SNR",null,"1998-01-01","SNR",null,"NORMANDIE"]
["1997-01-01","SNR",null,"1997-01-01","SNR",null,"1997-01-01","SNR",null,"1997-01-01","SNR",null,"OCCITANIE"]
["1996-01-01","SNR",null,"1996-01-01","SNR",null,"1996-01-01","SNR",null,"1996-01-01","SNR",null,"POLYNESIE FRANCAISE"]
["1995-01-01","SNR",null,"1995-01-01","SNR",null,"1995-01-01","SNR",null,"1995-01-01","SNR",null,"PROVENCE ALPES COTE D AZUR"]
["1994-01-01","SNR",null,"1994-01-01","SNR",null,"1994-01-01","SNR",null,"1994-01-01","SNR",null,"ST PIERRE ET MIQUELON"]
["1993-01-01","SNR",null,"1993-01-01","SNR",null,"1993-01-01","SNR",null,"1993-01-01","SNR"]
["1992-01-01","SNR",null,"1992-01-01","SNR",null,"1992-01-01","SNR",null,"1992-01-01","SNR"]
["1991-01-01","SNR",null,"1991-01-01","SNR",null,"1991-01-01","SNR",null,"1991-01-01","SNR"]
["1990-01-01","SNR",null,"1990-01-01","SNR",null,"1990-01-01","SNR",null,"1990-01-01","SNR"]
["1989-01-01","SNR",null,"1989-01-01","SNR",null,"1989-01-01","SNR",null,"1989-01-01","SNR"]
["1988-01-01","SNR",null,"1988-01-01","SNR",null,"1988-01-01","SNR",null,"1988-01-01","SNR"]
["1987-01-01","SNR",null,"1987-01-01","SNR",null,"1987-01-01","SNR",null,"1987-01-01","SNR"]
["1986-01-01","SNR",null,"1986-01-01","SNR",null,"1986-01-01","SNR",null,"1986-01-01","SNR"]
["1985-01-01","SNR",null,"1985-01-01","SNR",null,"1985-01-01","M1",null,"1985-01-01","M1"]
["1984-01-01","M1",null,"1984-01-01","M1",null,"1984-01-01","M1",null,"1984-01-01","M1"]
["1983-01-01","M1",null,"1983-01-01","M1",null,"1983-01-01","M1",null,"1983-01-01","M1"]
["1982-01-01","M1",null,"1982-01-01","M1",null,"1982-01-01","M1",null,"1982-01-01","M1"]
["1981-01-01","M1",null,"1981-01-01","M1",null,"1981-01-01","M1",null,"1981-01-01","M1"]
["1980-01-01","M1",null,"1980-01-01","M1",null,"1980-01-01","M1",null,"1980-01-01","M1"]
["1979-01-01","M1",null,"1979-01-01","M1",null,"1979-01-01","M1",null,"1979-01-01","M1"]
["1978-01-01","M1",null,"1978-01-01","M1",null,"1978-01-01","M1",null,"1978-01-01","M1"]
["1977-01-01","M1",null,"1977-01-01","M1",null,"1977-01-01","M1",null,"1977-01-01","M1"]
["1976-01-01","M1",null,"1976-01-01","M1",null,"1976-01-01","M1",null,"1976-01-01","M1"]
["1975-01-01","M1",null,"1975-01-01","M1",null,"1975-01-01","M2",null,"1975-01-01","M2"]
["1974-01-01","M2",null,"1974-01-01","M2",null,"1974-01-01","M2",null,"1974-01-01","M2"]
["1973-01-01","M2",null,"1973-01-01","M2",null,"1973-01-01","M2",null,"1973-01-01","M2"]
["1972-01-01","M2",null,"1972-01-01","M2",null,"1972-01-01","M2",null,"1972-01-01","M2"]
["1971-01-01","M2",null,"1971-01-01","M2",null,"1971-01-01","M2",null,"1971-01-01","M2"]
["1970-01-01","M2",null,"1970-01-01","M2",null,"1970-01-01","M2",null,"1970-01-01","M2"]
["1969-01-01","M2",null,"1969-01-01","M2",null,"1969-01-01","M2",null,"1969-01-01","M2"]
["1968-01-01","M2",null,"1968-01-01","M2",null,"1968-01-01","M2",null,"1968-01-01","M2"]
["1967-01-01","M2",null,"1967-01-01","M2",null,"1967-01-01","M2",null,"1967-01-01","M2"]
["1966-01-01","M2",null,"1966-01-01","M2",null,"1966-01-01","M2",null,"1966-01-01","M2"]
["1965-01-01","M2",null,"1965-01-01","M2",null,"1965-01-01","M3",null,"1965-01-01","M3"]
["1964-01-01","M3",null,"1964-01-01","M3",null,"1964-01-01","M3",null,"1964-01-01","M3"]
["1963-01-01","M3",null,"1963-01-01","M3",null,"1963-01-01","M3",null,"1963-01-01","M3"]
["1962-01-01","M3",null,"1962-01-01","M3",null,"1962-01-01","M3",null,"1962-01-01","M3"]
["1961-01-01","M3",null,"1961-01-01","M3",null,"1961-01-01","M3",null,"1961-01-01","M3"]
["1960-01-01","M3",null,"1960-01-01","M3",null,"1960-01-01","M3",null,"1960-01-01","M3"]
["1959-01-01","M3",null,"1959-01-01","M3",null,"1959-01-01","M3",null,"1959-01-01","M3"]
["1958-01-01","M3",null,"1958-01-01","M3",null,"1958-01-01","M3",null,"1958-01-01","M3"]
["1957-01-01","M3",null,"1957-01-01","M3",null,"1957-01-01","M3",null,"1957-01-01","M3"]
["1956-01-01","M3",null,"1956-01-01","M3",null,"1956-01-01","M3",null,"1956-01-01","M3"]
["1955-01-01","M3",null,"1955-01-01","M3",null,"1955-01-01","M4",null,"1955-01-01","M4"]
["1954-01-01","M4",null,"1954-01-01","M4",null,"1954-01-01","M4",null,"1954-01-01","M4"]
["1953-01-01","M4",null,"1953-01-01","M4",null,"1953-01-01","M4",null,"1953-01-01","M4"]
["1952-01-01","M4",null,"1952-01-01","M4",null,"1952-01-01","M4",null,"1952-01-01","M4"]
["1951-01-01","M4",null,"1951-01-01","M4",null,"1951-01-01","M4",null,"1951-01-01","M4"]
["1950-01-01","M4",null,"1950-01-01","M4",null,"1950-01-01","M4",null,"1950-01-01","M4"]
["1949-01-01","M4",null,"1949-01-01","M4",null,"1949-01-01","M4",null,"1949-01-01","M4"]
["1948-01-01","M4",null,"1948-01-01","M4",null,"1948-01-01","M4",null,"1948-01-01","M4"]
["1947-01-01","M4",null,"1947-01-01","M4",null,"1947-01-01","M4",null,"1947-01-01","M4"]
["1946-01-01","M4",null,"1946-01-01","M4",null,"1946-01-01","M4",null,"1946-01-01","M4"]
["1945-01-01","M4",null,"1945-01-01","M4",null,"1945-01-01","M4",null,"1945-01-01","M4"]
["1944-01-01","M4",null,"1944-01-01","M4",null,"1944-01-01","M4",null,"1944-01-01","M4"]
["1943-01-01","M4",null,"1943-01-01","M4",null,"1943-01-01","M4",null,"1943-01-01","M4"]
["1942-01-01","M4",null,"1942-01-01","M4",null,"1942-01-01","M4",null,"1942-01-01","M4"]
["1941-01-01","M4",null,"1941-01-01","M4",null,"1941-01-01","M4",null,"1941-01-01","M4"]
["1940-01-01","M4",null,"1940-01-01","M4",null,"1940-01-01","M4",null,"1940-01-01","M4"]
["1939-01-01","M4",null,"1939-01-01","M4",null,"1939-01-01","M4",null,"1939-01-01","M4"]
["1938-01-01","M4",null,"1938-01-01","M4",null,"1938-01-01","M4",null,"1938-01-01","M4"]
["1937-01-01","M4",null,"1937-01-01","M4",null,"1937-01-01","M4",null,"1937-01-01","M4"]
["1936-01-01","M4",null,"1936-01-01","M4",null,"1936-01-01","M4",null,"1936-01-01","M4"]
["1935-01-01","M4",null,"1935-01-01","M4",null,"1935-01-01","M4",null,"1935-01-01","M4"]
["1934-01-01","M4",null,"1934-01-01","M4",null,"1934-01-01","M4",null,"1934-01-01","M4"]
["1933-01-01","M4",null,"1933-01-01","M4",null,"1933-01-01","M4",null,"1933-01-01","M4"]
["1932-01-01","M4",null,"1932-01-01","M4",null,"1932-01-01","M4",null,"1932-01-01","M4"]
["1931-01-01","M4",null,"1931-01-01","M4",null,"1931-01-01","M4",null,"1931-01-01","M4"]
["1930-01-01","M4",null,"1930-01-01","M4",null,"1930-01-01","M4",null,"1930-01-01","M4"]
["1929-01-01","M4",null,"1929-01-01","M4",null,"1929-01-01","M4",null,"1929-01-01","M4"]

{"sheet":"Records_DC_F","index":5,"n_rows":61,"n_cols":5,"rows_kept":61,"cut":false,"hidden":false,"merged":[[0,0,0,4],[1,0,1,4],[2,0,2,1]]}
["Records DC Femmes"]
["D C"]
["Catégorie",null,"Athlète","Poids","Date"]
["-43kg","Subjunior","Durand Andrea",60,2013]
["-43kg","Junior"]
["-47kg","Subjunior","Durand Andrea",67.5,2012]
["-47kg","Junior","Bastien Eloise",60,"2023 Merignac (Fr)"]
["-47kg","Open","Legard Stephanie",80,"2019 Hamm(LUX)"]
["-47kg","Master1","Legard Stephanie",72.5,"2022 Beuzeville(Fr)"]
["-47kg","Master2","Servajean Martine",73,2017]
["-47kg","Master3","Servajean Martine",72.5,2018]
["-47kg","Master4","Boulle Liliane",42.5,2016]
["-52kg","Subjunior","Thibaud Marie",75,"2023 Merignac (Fr)"]
["-52kg","Junior","Herbaux Ines",82.5,"2023 Merignac (Fr)"]
["-52kg","Open","Huet Alison",101.5,"2023 La Garde (Fr)"]
["-52kg","Master1","Duverger Sylvie",73,2018]
["-52kg","Master2","Lesellier Christine",85,2019]
["-52kg","Master3","Landon Brigitte",60,"2023 La Garde (Fr)"]
["-52kg","Master4","Heligon Françoise",54,2018]
["-57kg","Subjunior","Khider Solyane",70,2018]
["-57kg","Junior","Alves Agnes",95,"2019 Hamm(LUX)"]
["-57kg","Open","Anthouard Melodie",107.5,2019]
["-57kg","Master1","Mingot Sylvie",98,2016]
["-57kg","Master2","Pracella Marie Christine",97.5,2015]
["-57kg","Master3","Lesellier Christine",82.5,"2023 Merignac (Fr)"]
["-57kg","Master4","Heligon Françoise",58.5,"2019 Hamm(LUX)"]
["-63kg","Subjunior","Picazzo Elodie",82.5,"2022 Beuzeville(Fr)"]
["-63kg","Junior","Pailha Camille",95,"2019 Hamm(LUX)"]
["-63kg","Open","Anthouard Melodie",110,"2019 Barcelone(ESP)"]
["-63kg","Master1","Maniez Christelle",93,2017]
["-63kg","Master2","Pracella Marie Christine",90,2019]
["-63kg","Master3","Herbin Evelyne",80,2018]
["-63kg","Master4"]
["-69kg","Subjunior","Le Douarin  Nolwenn",57.5,"2023 La Garde (Fr)"]
["-69kg","Junior","Bouchoux Andorina",112.5,"2023 La Garde (Fr)"]
["-69kg","Open","Bouchoux Andorina",112.5,"2023 La Garde (Fr)"]
["-69kg","Master1","Clavier Emilie",87.5,"2023 Merignac (Fr)"]
["-69kg","Master2","Leccese Florence",77.5,"2023 Sun City (SA)"]
["-69kg","Master3","Maciejewski Patricia",83,"2023 Sun City (SA)"]
["-69kg","Master4"]
["-76kg","Subjunior","Le Douarin Nolwenn",67.5,"2023 Merignac (Fr)"]
["-76kg","Junior","Mautalen Laura",141.5,"2022 Almati (Kaz)"]
["-76kg","Open","Mautalen Laura",141.5,"2022 Almati (Kaz)"]
["-76kg","Master1","Alberti Stephanie",115,"2023 Sun City (SA)"]
["-76kg","Master2","Leccese Florence",72.5,"2022 Almati (Kaz)"]
["-76kg","Master3","Zielman Francoise",60,"2023 La Garde (Fr)"]
["-76kg","Master4","Laurent Martine",61,"2022 Beuzeville(Fr)"]
["-84kg","Subjunior"]
["-84kg","Junior","Mautalens Laura",115,"2021 Le Puy en Velay(fr)"]
["-84kg","Open","Franch Guerra Julie",126,"2022 Beuzeville(Fr)"]
["-84kg","Master1","Bastien Stephanie",93,"2023 La Garde (Fr)"]
["-84kg","Master2","Gransard Nathalie",75,2017]
["-84kg","Master3","Herbin Evelyne",77.5,"2019 Hamm(LUX)"]
["-84kg","Master4","Laurent Martine",65,"2021 Le Puy en Velay(fr)"]
["+84kg","Subjunior","Messaoui Camellia",75,"2019 Hamm(LUX)"]
["+84kg","Junior","Dezier Camille",90,2015]
["+84kg","Open","Mierger Amelie",157.5,"2023 Merignac (Fr)"]
["+84kg","Master1"]
["+84kg","Master2","Duhem Leila",120,2017]
["+84kg","Master3"]
["+84kg","Master4"]

{"sheet":"Records_DC_H","index":6,"n_rows":61,"n_cols":5,"rows_kept":61,"cut":false,"hidden":false,"merged":[[0,0,0,4],[1,0,1,4],[2,0,2,1]]}
["Records DC Hommes"]
["D C"]
["Catégorie",null,"Athlète","Poids","Date"]
["-53kg","Subjunior","Blangy Anthony",90.5,2015]
["-53kg","Junior","Valette Killian",100.5,"2023 La Garde (Fr)"]
["-59kg","Subjunior","Huchet Urbain",107.5,"2023 Merignac (Fr)"]
["-59kg","Junior","Charbonnier Hermann",127.5,"2023 Merignac (Fr)"]
["-59kg","Open","Rezaee William",128,2019]
["-59kg","Master1","Voisin Denis",110,2015]
["-59kg","Master2","Marigo Gilles ",120,"2023 Sun City (SA)"]
["-59kg","Master3","Bonnefoy Jean",97.5," 2022 Beuzeville(Fr)"]
["-59kg","Master4","Gallart Pierre",110,2015]
["-66kg","Subjunior","Nativel Florian",137.5,2016]
["-66kg","Junior","Sahari Medhi",170,2019]
["-66kg","Open","Manuel Virgilio",175,2015]
["-66kg","Master1","Manuel Virgilio",175,2015]
["-66kg","Master2","Waymel Olivier",145,2018]
["-66kg","Master3","Sitruk Claude",140,2016]
["-66kg","Master4","Sitruk Claude",128,"2022 Beuzeville(Fr)"]
["-74kg","Subjunior","Poyet Bastien",157.5,2013]
["-74kg","Junior","Poyet Bastien",202.5,2018]
["-74kg","Open","Poyet Bastien",205,2019]
["-74kg","Master1","Husse Sacha",175,"2022 Almati (Kaz)"]
["-74kg","Master2","Lager Mickael",165,"2023 La Garde (Fr)"]
["-74kg","Master3","Valladas Philippe",140,"2023 La Garde (Fr)"]
["-74kg","Master4","Dernoncourt Michel",120,2016]
["-83kg","Subjunior","Avon Mbume Julien",160,2013]
["-83kg","Junior","Costarigot Anthony",184.5,"2021 Le Puy en Velay(fr)"]
["-83kg","Open","Sahari Medhi",220,"2022 Budapest (ho)"]
["-83kg","Master1","Lenglet Florent",190,2019]
["-83kg","Master2","Bertin Fabrice",165,2018]
["-83kg","Master3","Langevin Philippe",155,"2021 Le Puy en Velay(fr)"]
["-83kg","Master4","Collard Alain",127.5,"2022 Beuzeville(Fr)"]
["-93kg","Subjunior","Gloaguen Ethan",152.5,"2023 La Garde (Fr)"]
["-93kg","Junior","Cuesta Nicolas",202.5,2018]
["-93kg","Open","Begue Gabriel",207.5,"2023 La Garde (Fr)"]
["-93kg","Master1","Bertho Richard",203,"2021 Le Puy en Velay(fr)"]
["-93kg","Master2","France Hervé",187.5,"2023 Sun City (SA)"]
["-93kg","Master3","Simian Claude",160,"2023 Merignac (Fr)"]
["-93kg","Master4","Courtehoux Pierre",145,"2023 Sun City (SA)"]
["-105kg","Subjunior","Falcucci Andrea",145.5,"2023 La Garde (Fr)"]
["-105kg","Junior","Gomez Clement",197.5,"2023 Merignac (Fr)"]
["-105kg","Open","D’heer Kevin",221.5,"2021 Le Puy en Velay(fr)"]
["-105kg","Master1","Bertho Richard",212.5,"2023 La Garde (Fr)"]
["-105kg","Master2","Buttigieg Frederic",220.5,2019]
["-105kg","Master3","Leroy Fabrice",165,"2023 La Garde (Fr)"]
["-105kg","Master4","Couchy Stanislas",155,"2023 La Garde (Fr)"]
["-120kg","Subjunior"]
["-120kg","Junior","Peyraud Nicolas",207.5,"2019 Hamm(LUX)"]
["-120kg","Open","D’heer Kevin",242.5,"2023 Merignac (Fr)"]
["-120kg","Master1","Billoir Philippe",240,2018]
["-120kg","Master2","Minelle Jean Yves",210,2016]
["-120kg","Master3","Oumalia Gerard ",170,2016]
["-120kg","Master4","Pigeon Christian",150,"2023 La Garde (Fr)"]
["+120kg","Subjunior","Doyotte Andy",155,"2023 La Garde (Fr)"]
["+120kg","Junior","Paagalua Patelisio",205,2017]
["+120kg","Open","Masse Romuald",263,"2022 Beuzeville(Fr)"]
["+120kg","Master1","Teraiharoa Torio",232.5,"2023 La Garde (Fr)"]
["+120kg","Master2","Savoie Jean Jacques",211,"2023 La Garde (Fr)"]
["+120kg","Master3","Lefebre Patrice",185,"2022 Beuzeville(Fr)"]
["+120kg","Master4","Robineau Joel",110,"2021 Vilnius (lit)"]

{"sheet":"Records_BP_F","index":7,"n_rows":43,"n_cols":5,"rows_kept":43,"cut":false,"hidden":false,"merged":[[0,0,0,4],[1,0,1,4],[2,0,2,1]]}
["Records BP Femmes"]
["BP"]
["Catégorie",null,"Athlète","Poids","Date"]
["-47kg","Open","Martin Yvelise",95,2014]
["-47kg","Master1","Feraud Nathalie",88,2015]
["-47kg","Master2","Lesellier Christine",85,2013]
["-47kg","Master3","Roche Martine",67.5,"2023 Merignac (Fr)"]
["-47kg","Master4"]
["-52kg","Open","Mingot Audrey",110,2017]
["-52kg","Master1","Feraud Nathalie",91.5,2019]
["-52kg","Master2","Feraud Nathalie",91.5,"2020 Pontoise(Fr)"]
["-52kg","Master3","Roche Martine",77.5,"2020 Pontoise(Fr)"]
["-52kg","Master4","Eligon Françoise",64.5,2017]
["-57kg","Open","Anthouard Melodie",140,2019]
["-57kg","Master1","Mingot Sylvie",120,2013]
["-57kg","Master2","Pracella Marie Christine",112.5,2015]
["-57kg","Master3","Parfait Martine",67,2018]
["-57kg","Master4","Heligon Françoise",71,2019]
["-63kg","Open","Anthouard Melodie",138,2018]
["-63kg","Master1","Iliev Isabelle",137.5,2016]
["-63kg","Master2","Maciejewski Patricia",110,2014]
["-63kg","Master3","Herbin Evelyne",90,2016]
["-63kg","Master4","Lerche Maryse",62.5,2019]
["-69kg","Open"]
["-69kg","Master1"]
["-69kg","Master2","Leccese Florence",95,"2022 Almati (Kaz)"]
["-69kg","Master3","Maciejewski Patricia",90,"2023 Sun City (SA)"]
["-69kg","Master4"]
["-76kg","Open"]
["-76kg","Master1"]
["-76kg","Master2"]
["-76kg","Master3"]
["-76kg","Master4"]
["-84kg","Open","Duhem Leila",155,2014]
["-84kg","Master1","Bastien Stephanie",130.5,"2023 Bordeaux (Fr)"]
["-84kg","Master2","Duhem Leila",155,2014]
["-84kg","Master3","Herbin Evelyne",87.5,2019]
["-84kg","Master4","Laurent Martine",70,"2021 Blanquefort (F)"]
["+84kg","Open","Duhem Leila",167.5,2012]
["+84kg","Master1","Duhem Leila",167.5,2012]
["+84kg","Master2","Duhem Leila",162.5,2016]
["+84kg","Master3"]
["+84kg","Master4"]

{"sheet":"Records_BP_H","index":8,"n_rows":43,"n_cols":5,"rows_kept":43,"cut":false,"hidden":false,"merged":[[2,0,2,1],[1,0,1,4],[0,0,0,4]]}
["Records BP Hommes"]
["BP"]
["Catégorie",null,"Athlète","Poids","Date"]
["-59kg","Open"]
["-59kg","Master1"]
["-59kg","Master2"]
["-59kg","Master3","Gallart Pierre",122.5,2014]
["-59kg","Master4","Gallart Pierre",120,2014]
["-66kg","Open","Manuel Virgilio",225,2015]
["-66kg","Master1","Manuel Virgilio",225,2015]
["-66kg","Master2","Waymel Olivier",200.5,2018]
["-66kg","Master3","Sitruk Claude",170.5,2012]
["-66kg","Master4","Sitruk Claude",150,"2020 Pontoise (Fr)"]
["-74kg","Open","Poinson Adrien",260,2013]
["-74kg","Master1","Cucuzella Alphonse",230.5,2013]
["-74kg","Master2","Cucuzella Alphonse",213,2016]
["-74kg","Master3","Dernoncourt Michel",155,2011]
["-74kg","Master4","Dernoncourt Michel",150.5,2016]
["-83kg","Open","Pinguet Cyril",240,2012]
["-83kg","Master1","Pinguet Cyril",240,2012]
["-83kg","Master2","Bertin Fabrice",222.5,2019]
["-83kg","Master3","Deconinck Erick",185,2017]
["-83kg","Master4","Dernoncourt Michel",145,2019]
["-93kg","Open","Bertin Fabrice",255,"2023 Merignac (Fr)"]
["-93kg","Master1","Marneur Michel",250,2012]
["-93kg","Master2","Bertin Fabrice",255,"2023 Merignac (Fr)"]
["-93kg","Master3","Deconinck Erick",191,"2021 Blanquefort (F)"]
["-93kg","Master4","Boussery Alain",140,2017]
["-105kg","Open","Grenier Allan",325,2019]
["-105kg","Master1","Bier Gilbert",252.5,2012]
["-105kg","Master2","Leroy Fabrice",250,2016]
["-105kg","Master3","Leroy Fabrice",215,"2023 Bordeaux (Fr)"]
["-105kg","Master4","Verne Lucien",135,2017]
["-120kg","Open","Duval Charles",290,2016]
["-120kg","Master1","Duval Charles",290,2016]
["-120kg","Master2","Minelle Jean Yves",252.5,2018]
["-120kg","Master3","Oumalia Gerard",220,2017]
["-120kg","Master4","Robineau Joel",130,"2020 Pontoise (Fr)"]
["+120kg","Open","Guidez Jerome",340,2018]
["+120kg","Master1","Guidez Jerome",340,2018]
["+120kg","Master2","Lefevre Patrice",265,2017]
["+120kg","Master3","Rossetti Renaldo",225,"2020 Pontoise (Fr)"]
["+120kg","Master4","Robineau Joel",125,"2021 Vilnius (lit)"]